{"text_format":"1","workbook":"xlsx","n_sheets":18,"sheets":["表紙","更新履歴","目次","０２発注","１１入庫予定","２２出荷報告","４２販売報告","６４取引先コード照会 ・６７取引先コード照会結果","０３発注","１３入庫予定","１４受領","１８返品通知","２３出荷報告","３５請求明細","３６支払明細","４３販売報告","集配信状況照会","エンドレコード"],"not_rendered":{"charts":0,"images":0,"macros":0,"external_links":1,"defined_names":30,"comments":0,"pivot_tables":0},"unopened":[],"bounds":{"document_bytes":16777216,"sheet_cells":100000,"rows_first":2000,"rows_last":500,"rows_between":2000,"halvings":0,"cell_chars":16384,"cell_head_chars":4096},"cells_cut":0,"cells_raw":0,"read":"whole","date_system":"1900"}

{"sheet":"表紙","index":0,"n_rows":56,"n_cols":36,"rows_kept":56,"cut":false,"hidden":false,"merged":[[11,29,11,61],[20,26,20,64],[59,77,59,89],[40,30,40,60],[42,30,42,60],[49,35,49,56],[52,35,52,56],[55,35,55,56]]}
[]
[]
[]
[]
[]
[]
[]
[]
[]
[]
[]
[null,null,null,null,null,null,null,null,null,null,null,null,null,null,null,null,null,null,null,null,null,null,null,null,null,null,null,null,null,"ｅ-お菓子ねっと"]
[]
[]
[]
[]
[]
[]
[]
[]
[null,null,null,null,null,null,null,null,null,null,null,null,null,null,null,null,null,null,null,null,null,null,null,null,null,null,"Ｗｅｂ－ＥＤＩフォーマット"]
[]
[]
[]
[]
[]
[]
[]
[]
[]
[]
[null,null,null,null,null,null,null,null,null,null,null,null,null,null,null,null,null,null,null,null," "]
[]
[]
[]
[]
[]
[]
[]
[]
[null,null,null,null,null,null,null,null,null,null,null,null,null,null,null,null,null,null,null,null,null,null,null,null,null,null,null,null,null,null,"第２.８版"]
[]
[null,null,null,null,null,null,null,null,null,null,null,null,null,null,null,null,null,null,null,null,null,null,null,null,null,null,null,null,null,null,"2023-07-14"]
[]
[]
[]
[]
[]
[]
[null,null,null,null,null,null,null,null,null,null,null,null,null,null,null,null,null,null,null,null,null,null,null,null,null,null,null,null,null,null,null,null,null,null,null,"e-お菓子ねっと"]
[]
[]
[null,null,null,null,null,null,null,null,null,null,null,null,null,null,null,null,null,null,null,null,null,null,null,null,null,null,null,null,null,null,null,null,null,null,null,"全国菓子卸商業組合連合会"]
[]
[]
[null,null,null,null,null,null,null,null,null,null,null,null,null,null,null,null,null,null,null,null,null,null,null,null,null,null,null,null,null,null,null,null,null,null,null,"全  日  本  菓  子  協  会"]

{"sheet":"更新履歴","index":1,"n_rows":145,"n_cols":81,"rows_kept":145,"cut":false,"hidden":false,"merged":[[122,4,122,6],[122,7,122,12],[61,7,61,12],[6,80,6,91],[6,4,6,6],[42,4,42,6],[42,7,42,12],[27,4,27,6],[27,7,27,12],[29,7,29,12],[29,4,29,6],[34,4,34,6],[34,7,34,12],[72,4,72,6],[72,80,72,91],[73,7,73,12],[212,83,212,93],[208,28,208,59],[7,4,7,6],[8,4,8,6],[7,7,7,12],[8,7,8,12],[16,4,16,6],[16,7,16,12],[19,4,19,6],[19,7,19,12],[24,7,24,12],[24,4,24,6],[37,4,37,6],[37,7,37,12],[45,4,45,6],[45,7,45,12],[108,4,108,6],[108,7,108,12],[94,4,94,6],[94,7,94,12],[78,7,78,12],[92,4,92,6],[92,7,92,12],[87,4,87,6],[87,7,87,12],[89,4,89,6],[89,7,89,12],[90,7,90,12],[90,4,90,6],[141,4,141,6],[141,80,141,91],[142,7,142,12],[146,7,146,12],[155,4,155,6],[155,7,155,12],[157,4,157,6],[157,7,157,12],[158,4,158,6],[158,7,158,12],[160,4,160,6],[160,7,160,12],[162,4,162,6],[162,7,162,12],[176,4,176,6],[176,7,176,12],[190,4,190,6],[190,7,190,12]]}
[]
[]
[]
[null,null,null,null,"更新履歴"]
[]
[]
[null,null,null,null,"版数",null,null,null,"更新年月日",null,null,null,null,null,null,"更新概要",null,null,null,null,null,null,null,null,null,null,null,null,null,null,null,null,null,null,null,null,null,null,null,null,null,null,null,null,null,null,null,null,null,null,null,null,null,null,null,null,null,null,null,null,null,null,null,null,null,null,null,null,null,null,null,null,null,null,null,null,null,null,null,null,"ページ"]
[null,null,null,null,"1.0",null,null,"2015/10/19",null,null,null,null,null,"新システム化に伴い全面刷新"]
[null,null,null,null,"1.1",null,null,"2016/11/11",null,null,null,null,null,"V2フォーマット見直し（カナ項目新設）対応"]
[null,null,null,null,null,null,null,null,null,null,null,null,null,"　","V1･02発注、22出荷報告",null,null,null,null,null,null,null,null,null,null,null,null,null,null,"の一次店名カナ、二次店名カナ、届け先名カナ、摘要欄、商品名",null,null,null,null,null,null,null,null,null,null,null,null,null,null,null,null,null,null,null,null,null,null,"のV2からのコンバート方法（日本語区分判定により編集元を切替）を変更",null,null,null,null,null,null,null,null,null,null,null,null,null,null,null,null,null,null,null,null,null,null,null,null,null,null,null,"1,2,5,6"]
[null,null,null,null,null,null,null,null,null,null,null,null,null,null,"V1･11入庫予定",null,null,null,null,null,null,null,null,null,null,null,null,null,null,"の届け先名カナ、摘要欄、商品名",null,null,null,null,null,null,null,null,null,null,null,null,null,null,null,null,null,null,null,null,null,null,"のV2からのコンバート方法（日本語区分判定により編集元を切替）を変更",null,null,null,null,null,null,null,null,null,null,null,null,null,null,null,null,null,null,null,null,null,null,null,null,null,null,null,"3,4"]
[null,null,null,null,null,null,null,null,null,null,null,null,null,null,"V1･33請求、34支払",null,null,null,null,null,null,null,null,null,null,null,null,null,null,"の請求(支払)先、請求(支払)元、届け先名カナ",null,null,null,null,null,null,null,null,null,null,null,null,null,null,null,null,null,null,null,null,null,null,"のV2からのコンバート方法（日本語区分判定により編集元を切替）を変更",null,null,null,null,null,null,null,null,null,null,null,null,null,null,null,null,null,null,null,null,null,null,null,null,null,null,null,"7,8,9,10"]
[null,null,null,null,null,null,null,null,null,null,null,null,null,null,"V1･42販売報告",null,null,null,null,null,null,null,null,null,null,null,null,null,null,"の一次店名カナ、二次店名カナ、届け先名カナ",null,null,null,null,null,null,null,null,null,null,null,null,null,null,null,null,null,null,null,null,null,null,"のV2からのコンバート方法（日本語区分判定により編集元を切替）を変更",null,null,null,null,null,null,null,null,null,null,null,null,null,null,null,null,null,null,null,null,null,null,null,null,null,null,null,"11"]
[null,null,null,null,null,null,null,null,null,null,null,null,null,null,"V2･03発注、13入庫予定、23出荷報告",null,null,null,null,null,null,null,null,null,null,null,null,null,null,"に一次店カナ名、二次店カナ名、届け先カナ名、摘要カナ、商品名カナ",null,null,null,null,null,null,null,null,null,null,null,null,null,null,null,null,null,null,null,null,null,null,null,null,null,null,null,null,null,null,null,"を追加、項目追加に伴い予備欄の桁数を変更",null,null,null,null,null,null,null,null,null,null,null,null,null,null,null,null,null,null,"15,18,26"]
[null,null,null,null,null,null,null,null,null,null,null,null,null,null,"V2･35請求明細、36支払明細",null,null,null,null,null,null,null,null,null,null,null,null,null,null,"に請求先(元)カナ名、一次店カナ名、二次店カナ名、届け先カナ名、摘要カナ、商品名カナ",null,null,null,null,null,null,null,null,null,null,null,null,null,null,null,null,null,null,null,null,null,null,null,null,null,null,null,null,null,null,null,"を追加、項目追加に伴い予備欄の桁数を変更",null,null,null,null,null,null,null,null,null,null,null,null,null,null,null,null,null,null,"30,34"]
[null,null,null,null,null,null,null,null,null,null,null,null,null,null,"V2･43販売報告",null,null,null,null,null,null,null,null,null,null,null,null,null,null,"に一次店カナ名、二次店カナ名、届け先カナ名、商品名カナ",null,null,null,null,null,null,null,null,null,null,null,null,null,null,null,null,null,null,null,null,null,null,null,null,null,null,null,null,null,null,null,"を追加、項目追加に伴い予備欄の桁数を変更",null,null,null,null,null,null,null,null,null,null,null,null,null,null,null,null,null,null,"36"]
[null,null,null,null,"1.2",null,null,"2016/11/11",null,null,null,null,null,"請求・支払のV1・V2相互連携対応"]
[null,null,null,null,null,null,null,null,null,null,null,null,null,null,"V1･33請求､34支払",null,null,null,null,null,null,null,null,null,null,null,null,null,null,"V1→V2連携時のチェック仕様追記､V1←V2連携時のコンバート仕様追記",null,null,null,null,null,null,null,null,null,null,null,null,null,null,null,null,null,null,null,null,null,null,null,null,null,null,null,null,null,null,null,null,null,null,null,null,null,null,null,null,null,null,null,null,null,null,null,null,null,null,"7,8,9,10"]
[null,null,null,null,null,null,null,null,null,null,null,null,null,null,"V2･35請求明細、36支払明細",null,null,null,null,null,null,null,null,null,null,null,null,null,null,"V2←V1連携時のコンバート仕様追記、V2･明細型→V1連携不可のチェック仕様追加",null,null,null,null,null,null,null,null,null,null,null,null,null,null,null,null,null,null,null,null,null,null,null,null,null,null,null,null,null,null,null,null,null,null,null,null,null,null,null,null,null,null,null,null,null,null,null,null,null,null,"27,28,29,30,31,32,33,34"]
[null,null,null,null,"1.3",null,null,"2016/11/11",null,null,null,null,null,"V2→V1連携時の次店コードチェック仕様見直し対応"]
[null,null,null,null,null,null,null,null,null,null,null,null,null,null,"V1･11入庫予定",null,null,null,null,null,null,null,null,null,null,null,null,null,null,"の届け先コードのV2からのコンバート方法（GLN時は下8桁、その他は上8桁編集）を変更",null,null,null,null,null,null,null,null,null,null,null,null,null,null,null,null,null,null,null,null,null,null,null,null,null,null,null,null,null,null,null,null,null,null,null,null,null,null,null,null,null,null,null,null,null,null,null,null,null,null,"3"]
[null,null,null,null,null,null,null,null,null,null,null,null,null,null,"V1・22出荷報告、42販売報告",null,null,null,null,null,null,null,null,null,null,null,null,null,null,"の二次店コード、届け先コードのV2からのコンバート方法（GLN時は下8桁、その他は上8桁編集）を変更",null,null,null,null,null,null,null,null,null,null,null,null,null,null,null,null,null,null,null,null,null,null,null,null,null,null,null,null,null,null,null,null,null,null,null,null,null,null,null,null,null,null,null,null,null,null,null,null,null,null,"5,11"]
[null,null,null,null,null,null,null,null,null,null,null,null,null,null,"V2･13入庫予定",null,null,null,null,null,null,null,null,null,null,null,null,null,null,"の届け先コードのチェック仕様見直し（統一取引先コードのみ可 → 全て可）",null,null,null,null,null,null,null,null,null,null,null,null,null,null,null,null,null,null,null,null,null,null,null,null,null,null,null,null,null,null,null,null,null,null,null,null,null,null,null,null,null,null,null,null,null,null,null,null,null,null,"17"]
[null,null,null,null,null,null,null,null,null,null,null,null,null,null,"V2･23出荷報告、43販売報告",null,null,null,null,null,null,null,null,null,null,null,null,null,null,"の二次店コード、届け先コードのチェック仕様見直し（統一取引先コードのみ可 → 全て可）",null,null,null,null,null,null,null,null,null,null,null,null,null,null,null,null,null,null,null,null,null,null,null,null,null,null,null,null,null,null,null,null,null,null,null,null,null,null,null,null,null,null,null,null,null,null,null,null,null,null,"25,35"]
[null,null,null,null,"1.4",null,null,"2016/11/25",null,null,null,null,null,"請求・支払のV1・V2相互連携対応"]
[null,null,null,null,null,null,null,null,null,null,null,null,null,null,"V1･34支払",null,null,null,null,null,null,null,null,null,null,null,null,null,null,"振込IDのV1←V2コンバート記載誤り（属性初期値→○）を修正､V2フォーマット対応項目を追記",null,null,null,null,null,null,null,null,null,null,null,null,null,null,null,null,null,null,null,null,null,null,null,null,null,null,null,null,null,null,null,null,null,null,null,null,null,null,null,null,null,null,null,null,null,null,null,null,null,null,"10"]
[null,null,null,null,null,null,null,null,null,null,null,null,null,null,"V2･35請求明細、36支払明細",null,null,null,null,null,null,null,null,null,null,null,null,null,null,"請求金額合計､支払金額合計､請求金額､支払金額の変更欄に「1.2」を追記（項目桁数変更のため）",null,null,null,null,null,null,null,null,null,null,null,null,null,null,null,null,null,null,null,null,null,null,null,null,null,null,null,null,null,null,null,null,null,null,null,null,null,null,null,null,null,null,null,null,null,null,null,null,null,null,"28,32"]
[null,null,null,null,"1.5",null,null,"2017/2/3",null,null,null,null,null,"項番見直し"]
[null,null,null,null,null,null,null,null,null,null,null,null,null,null,"V2･23出荷報告",null,null,null,null,null,null,null,null,null,null,null,null,null,null,"他情報種と記載方法を統一（明細部以降の項番を修正）",null,null,null,null,null,null,null,null,null,null,null,null,null,null,null,null,null,null,null,null,null,null,null,null,null,null,null,null,null,null,null,null,null,null,null,null,null,null,null,null,null,null,null,null,null,null,null,null,null,null,"25"]
[null,null,null,null,"1.6",null,null,"2017/03/01",null,null,null,null,null,"請求・支払のV1・V2相互連携対応"]
[null,null,null,null,null,null,null,null,null,null,null,null,null,null,"V2・35請求明細、36支払明細",null,null,null,null,null,null,null,null,null,null,null,null,null,null,"集計明細区分＝集計の場合のチェック仕様を変更（明細時：必須＋コード、集計時：属性）",null,null,null,null,null,null,null,null,null,null,null,null,null,null,null,null,null,null,null,null,null,null,null,null,null,null,null,null,null,null,null,null,null,null,null,null,null,null,null,null,null,null,null,null,null,null,null,null,null,null,"28,32"]
[null,null,null,null,null,null,null,null,null,null,null,null,null,null,null,null,null,null,null,null,null,null,null,null,null,null,null,null,null,"トレーラレコードの伝票枚数の設定要領を変更",null,null,null,null,null,null,null,null,null,null,null,null,null,null,null,null,null,null,null,null,null,null,null,null,null,null,null,null,null,null,null,null,null,null,null,null,null,null,null,null,null,null,null,null,null,null,null,null,null,null,"29,33"]
[null,null,null,null,null,null,null,null,null,null,null,null,null,"V2フォーマット見直し対応"]
[null,null,null,null,null,null,null,null,null,null,null,null,null,null,"V2・43販売報告",null,null,null,null,null,null,null,null,null,null,null,null,null,null,"トレーラレコードの伝票枚数→明細件数変更の変更履歴記載漏れ追記",null,null,null,null,null,null,null,null,null,null,null,null,null,null,null,null,null,null,null,null,null,null,null,null,null,null,null,null,null,null,null,null,null,null,null,null,null,null,null,null,null,null,null,null,null,null,null,null,null,null,"36"]
[null,null,null,null,"1.7",null,null,"2017/10/12",null,null,null,null,null,"V2データ種追加対応（受領、返品通知）",null,null,null,null,null,null,null,null,null,null,null,null,null,null,null,"V2受領、V2返品通知レイアウト追加"]
[null,null,null,null,null,null,null,null,null,null,null,null,null,null,null,null,null,null,null,null,null,null,null,null,null,null,null,null,null,"上記追加に伴う目次修正、通しページ修正",null,null,null,null,null,null,null,null,null,null,null,null,null,null,null,null,null,null,null,null,null,null,null,null,null,null,null,null,null,null,null,null,null,null,null,null,null,null,null,null,null,null,null,null,null,null,null,null,null,null,"全般"]
[null,null,null,null,null,null,null,null,null,null,null,null,null,"V2・出荷報告",null,null,null,null,null,null,null,null,null,null,null,null,null,null,null,"卸発注伝票NOの項目説明を修正",null,null,null,null,null,null,null,null,null,null,null,null,null,null,null,null,null,null,null,null,null,null,null,null,null,null,null,null,null,null,null,null,null,null,null,null,null,null,null,null,null,null,null,null,null,null,null,null,null,null,"24"]
[null,null,null,null,"1.8",null,null,"2018/05/07",null,null,null,null,null,"トレーラレコードのレコード件数に関する記述修正",null,null,null,null,null,null,null,null,null,null,null,null,null,null,null,"ﾄﾚｰﾗｰﾚｺｰﾄﾞの「ﾚｺｰﾄﾞ件数」項目の修正、注記追加",null,null,null,null,null,null,null,null,null,null,null,null,null,null,null,null,null,null,null,null,null,null,null,null,null,null,null,null,null,null,null,null,null,null,null,null,null,null,null,null,null,null,null,null,null,null,null,null,null,null,"2,4,6,8,10,11,12,15,18,21"]
[null,null,null,null,null,null,null,null,null,null,null,null,null,null,null,null,null,null,null,null,null,null,null,null,null,null,null,null,null,null,null,null,null,null,null,null,null,null,null,null,null,null,null,null,null,null,null,null,null,null,null,null,null,null,null,null,null,null,null,null,null,null,null,null,null,null,null,null,null,null,null,null,null,null,null,null,null,null,null,null,"23,26,29,30,33,34,36"]
[null,null,null,null,null,null,null,null,null,null,null,null,null,"表記変更　Web2008→Web-EDI",null,null,null,null,null,null,null,null,null,null,null,null,null,null,null,"タイトルを「Web2008フォーマット」から「Web-EDIフォーマット」に変更",null,null,null,null,null,null,null,null,null,null,null,null,null,null,null,null,null,null,null,null,null,null,null,null,null,null,null,null,null,null,null,null,null,null,null,null,null,null,null,null,null,null,null,null,null,null,null,null,null,null,"表紙"]
[null,null,null,null,null,null,null,null,null,null,null,null,null,null,null,null,null,null,null,null,null,null,null,null,null,null,null,null,null,"各見出し名称を「「Web2008フォーマット」から「Web-EDIフォーマット」に変更",null,null,null,null,null,null,null,null,null,null,null,null,null,null,null,null,null,null,null,null,null,null,null,null,null,null,null,null,null,null,null,null,null,null,null,null,null,null,null,null,null,null,null,null,null,null,null,null,null,null,"目次,1,13,37"]
[null,null,null,null,null,null,null,null,null,null,null,null,null,"V１・出荷報告",null,null,null,null,null,null,null,null,null,null,null,null,null,null,null,"賞味期限製造年月日の項目説明の誤りを修正　(YMMDD)→(YYMMDD)",null,null,null,null,null,null,null,null,null,null,null,null,null,null,null,null,null,null,null,null,null,null,null,null,null,null,null,null,null,null,null,null,null,null,null,null,null,null,null,null,null,null,null,null,null,null,null,null,null,null,"4"]
[null,null,null,null,"1.9",null,null,"2018/07/19",null,null,null,null,null,"入庫予定・賞味期限製造年月日のコンバート仕様の変更"]
[null,null,null,null,null,null,null,null,null,null,null,null,null,null,"V1・入庫予定",null,null,null,null,null,null,null,null,null,null,null,null,null,null,"賞味期限製造年月日のV2コンバート元を卸最新在庫日付から実入庫製品日付に変更",null,null,null,null,null,null,null,null,null,null,null,null,null,null,null,null,null,null,null,null,null,null,null,null,null,null,null,null,null,null,null,null,null,null,null,null,null,null,null,null,null,null,null,null,null,null,null,null,null,null,"4"]
[null,null,null,null,null,null,null,null,null,null,null,null,null,null,"V2・入庫予定",null,null,null,null,null,null,null,null,null,null,null,null,null,null,"卸最新在庫日付、実入庫製品日付のV1からのコンバート要領を変更",null,null,null,null,null,null,null,null,null,null,null,null,null,null,null,null,null,null,null,null,null,null,null,null,null,null,null,null,null,null,null,null,null,null,null,null,null,null,null,null,null,null,null,null,null,null,null,null,null,null,"18"]
[null,null,null,null,"2.0",null,null,"2018/xx/xx",null,null,null,null,null,"軽減税率対応"]
[null,null,null,null,null,null,null,null,null,null,null,null,null,null,"目次、V1･33請求､V1･34支払",null,null,null,null,null,null,null,null,null,null,null,null,null,null,"V1･33請求､V1･34支払の利用停止期限を追記",null,null,null,null,null,null,null,null,null,null,null,null,null,null,null,null,null,null,null,null,null,null,null,null,null,null,null,null,null,null,null,null,null,null,null,null,null,null,null,null,null,null,null,null,null,null,null,null,null,null,"7,9"]
[null,null,null,null,null,null,null,null,null,null,null,null,null,null,"V1・22出荷報告",null,null,null,null,null,null,null,null,null,null,null,null,null,null,"税率区分　を追加",null,null,null,null,null,null,null,null,null,null,null,null,null,null,null,null,null,null,null,null,null,null,null,null,null,null,null,null,null,null,null,null,null,null,null,null,null,null,null,null,null,null,null,null,null,null,null,null,null,null,"6"]
[null,null,null,null,null,null,null,null,null,null,null,null,null,null,"V2・23出荷報告",null,null,null,null,null,null,null,null,null,null,null,null,null,null,"消費税率のV1からのコンバート要領を変更",null,null,null,null,null,null,null,null,null,null,null,null,null,null,null,null,null,null,null,null,null,null,null,null,null,null,null,null,null,null,null,null,null,null,null,null,null,null,null,null,null,null,null,null,null,null,null,null,null,null,"25"]
[null,null,null,null,null,null,null,null,null,null,null,null,null,null,"V2・36支払明細",null,null,null,null,null,null,null,null,null,null,null,null,null,null,"支払確認期限区分､支払確認期限日付､支払確認期限日数　を追加",null,null,null,null,null,null,null,null,null,null,null,null,null,null,null,null,null,null,null,null,null,null,null,null,null,null,null,null,null,null,null,null,null,null,null,null,null,null,null,null,null,null,null,null,null,null,null,null,null,null,"34"]
[null,null,null,null,null,null,null,null,null,null,null,null,null,null,"V2・35請求明細､36支払明細",null,null,null,null,null,null,null,null,null,null,null,null,null,null,"卸最新在庫日付区分､卸最新在庫日付を資産譲渡日付区分､資産譲渡日付　に変更",null,null,null,null,null,null,null,null,null,null,null,null,null,null,null,null,null,null,null,null,null,null,null,null,null,null,null,null,null,null,null,null,null,null,null,null,null,null,null,null,null,null,null,null,null,null,null,null,null,null,"29,33"]
[null,null,null,null,null,null,null,null,null,null,null,null,null,null,null,null,null,null,null,null,null,null,null,null,null,null,null,null,null,"登録番号と下記項目の税率別内訳繰返（繰返＝３回）　を追加",null,null,null,null,null,null,null,null,null,null,null,null,null,null,null,null,null,null,null,null,null,null,null,null,null,null,null,null,null,null,null,null,null,null,null,null,null,null,null,null,null,null,null,null,null,null,null,null,null,null,"30,34"]
[null,null,null,null,null,null,null,null,null,null,null,null,null,null,null,null,null,null,null,null,null,null,null,null,null,null,null,null,null,"項目追加に伴い　今回請求金額符号～請求金額合計、今回支払金額符号～支払金額合計の項目説明を変更"]
[null,null,null,null,null,null,null,null,null,null,null,null,null,null,null,null,null,null,null,null,null,null,null,null,null,null,null,null,null,null," 消費税率､今回請求金額符号､今回請求金額､請求基本控除符号､請求基本控除､請求品種控除符号､請求品種控除､請求機能控除符号、"]
[null,null,null,null,null,null,null,null,null,null,null,null,null,null,null,null,null,null,null,null,null,null,null,null,null,null,null,null,null,null," 請求機能控除、請求控除その他符号、請求控除その他、請求消費税符号、請求消費税､税込請求金額符号､税込請求金額､"]
[null,null,null,null,null,null,null,null,null,null,null,null,null,null,null,null,null,null,null,null,null,null,null,null,null,null,null,null,null,null," 今回支払金額符号､今回支払金額､支払基本控除符号､支払基本控除､支払品種控除符号､支払品種控除､支払機能控除符号、"]
[null,null,null,null,null,null,null,null,null,null,null,null,null,null,null,null,null,null,null,null,null,null,null,null,null,null,null,null,null,null," 支払機能控除、支払控除その他符号、支払控除その他、支払消費税符号、支払消費税､税込支払金額符号､税込支払金額"]
[null,null,null,null,null,null,null,null,null,null,null,null,null,null,null,null,null,null,null,null,null,null,null,null,null,null,null,null,null,"V1からのコンバート要領に、V1フォーマットの利用停止期限を追記",null,null,null,null,null,null,null,null,null,null,null,null,null,null,null,null,null,null,null,null,null,null,null,null,null,null,null,null,null,null,null,null,null,null,null,null,null,null,null,null,null,null,null,null,null,null,null,null,null,null,"27,31"]
[null,null,null,null,null,null,null,null,null,null,null,null,null,null,null,null,null,null,null,null,null,null,null,null,null,null,null,null,null,"配信分割機能停止に伴い下記項目のコンバート仕様のセンター設定・集計記述　を削除",null,null,null,null,null,null,null,null,null,null,null,null,null,null,null,null,null,null,null,null,null,null,null,null,null,null,null,null,null,null,null,null,null,null,null,null,null,null,null,null,null,null,null,null,null,null,null,null,null,null,"29,33,34"]
[null,null,null,null,null,null,null,null,null,null,null,null,null,null,null,null,null,null,null,null,null,null,null,null,null,null,null,null,null,null," レコード件数､伝票枚数､請求金額合計符号､請求金額合計､支払金額合計符号､支払金額合計"]
[null,null,null,null,null,null,null,null,null,null,null,null,null,"全般",null,null,null,null,null,null,null,null,null,null,null,null,null,null,null,"｢＋:整数」 ⇒ ｢＋：正数」、「４捨５入」 ⇒ 「四捨五入」の誤記訂正"]
[]
[]
[]
[]
[]
[null,null,null,null,"（次頁に続く）"]
[]
[]
[]
[]
[null,null,null,null,"（前頁の続き）"]
[null,null,null,null,"版数",null,null,null,"更新年月日",null,null,null,null,null,null,"更新概要",null,null,null,null,null,null,null,null,null,null,null,null,null,null,null,null,null,null,null,null,null,null,null,null,null,null,null,null,null,null,null,null,null,null,null,null,null,null,null,null,null,null,null,null,null,null,null,null,null,null,null,null,null,null,null,null,null,null,null,null,null,null,null,null,"ページ"]
[null,null,null,null,null,"2.1",null,"2018/11/29",null,null,null,null,null,"軽減税率対応見直し"]
[null,null,null,null,null,null,null,null,null,null,null,null,null,"　","V1･22出荷報告",null,null,null,null,null,null,null,null,null,null,null,null,null,null,"明細レコードの　          ",null,null,null,null,null,null,null,"予備０５　の桁数を3→１バイトに縮小、税率区分　の必須欄に「○」を追記、",null,null,null,null,null,null,null,null,null,null,null,null,null,null,null,null,null,null,null,null,null,null,null,null,null,null,null,null,null,null,null,null,null,null,null,null,null,null,null,null,null,null,"6"]
[null,null,null,null,null,null,null,null,null,null,null,null,null,"　","V2･23出荷報告",null,null,null,null,null,null,null,null,null,null,null,null,null,null,"ヘッダー/明細レコードの　",null,null,null,null,null,null,null,"消費税区分、消費税率　   の必須欄に「○」を追記",null,null,null,null,null,null,null,null,null,null,null,null,null,null,null,null,null,null,null,null,null,null,null,null,null,null,null,null,null,null,null,null,null,null,null,null,null,null,null,null,null,null,"25"]
[null,null,null,null,null,null,null,null,null,null,null,null,null,null,"V2･35請求明細、36支払明細",null,null,null,null,null,null,null,null,null,null,null,null,null,null,"ヘッダー/明細レコードの　",null,null,null,null,null,null,null,"消費税区分、消費税率　   の必須欄に「○」を追記",null,null,null,null,null,null,null,null,null,null,null,null,null,null,null,null,null,null,null,null,null,null,null,null,null,null,null,null,null,null,null,null,null,null,null,null,null,null,null,null,null,null,"28,32"]
[null,null,null,null,null,null,null,null,null,null,null,null,null,null,null,null,null,null,null,null,null,null,null,null,null,null,null,null,null,"トレーラレコードの         ",null,null,null,null,null,null,null,"税率別内訳　のV1からのコンバート仕様見直し　「属性初期値」→「ALL SPACE」",null,null,null,null,null,null,null,null,null,null,null,null,null,null,null,null,null,null,null,null,null,null,null,null,null,null,null,null,null,null,null,null,null,null,null,null,null,null,null,null,null,null,"30,34"]
[null,null,null,null,null,"2.2",null,"2019/03/20",null,null,null,null,null,"V2→V1コンバート要領の改善"]
[null,null,null,null,null,null,null,null,null,null,null,null,null,null,"V1・02発注",null,null,null,null,null,null,null,null,null,null,null,null,null,null,"ヘッダーレコードの",null,null,null,null,null,null,null,"一次店コード、二次店コード、届け先コードのV2からのコンバート要領改善",null,null,null,null,null,null,null,null,null,null,null,null,null,null,null,null,null,null,null,null,null,null,null,null,null,null,null,null,null,null,null,null,null,null,null,null,null,null,null,null,null,null,"1"]
[null,null,null,null,null,null,null,null,null,null,null,null,null,null,"V1・11入庫予定",null,null,null,null,null,null,null,null,null,null,null,null,null,null,"ヘッダーレコードの",null,null,null,null,null,null,null,"届け先コードのV2からのコンバート要領改善",null,null,null,null,null,null,null,null,null,null,null,null,null,null,null,null,null,null,null,null,null,null,null,null,null,null,null,null,null,null,null,null,null,null,null,null,null,null,null,null,null,null,"3"]
[null,null,null,null,null,null,null,null,null,null,null,null,null,null,"V1・22出荷報告",null,null,null,null,null,null,null,null,null,null,null,null,null,null,"ヘッダーレコードの",null,null,null,null,null,null,null,"一次店コード、二次店コード、届け先コードのV2からのコンバート要領改善",null,null,null,null,null,null,null,null,null,null,null,null,null,null,null,null,null,null,null,null,null,null,null,null,null,null,null,null,null,null,null,null,null,null,null,null,null,null,null,null,null,null,"5"]
[null,null,null,null,null,null,null,null,null,null,null,null,null,null,"V1・42販売報告",null,null,null,null,null,null,null,null,null,null,null,null,null,null,"ヘッダーレコードの",null,null,null,null,null,null,null,"一次店コード、二次店コード、届け先コードのV2からのコンバート要領改善",null,null,null,null,null,null,null,null,null,null,null,null,null,null,null,null,null,null,null,null,null,null,null,null,null,null,null,null,null,null,null,null,null,null,null,null,null,null,null,null,null,null,"11"]
[null,null,null,null,null,null,null,null,null,null,null,null,null,"出荷報告の集計明細区分のコード値見直し"]
[null,null,null,null,null,null,null,null,null,null,null,null,null,null,"V2･23出荷報告",null,null,null,null,null,null,null,null,null,null,null,null,null,null,"ヘッダー/明細レコードの　",null,null,null,null,null,null,null,"集計明細区分のコード　「1:集計」　を　「1:集計（※未使用）」 に変更",null,null,null,null,null,null,null,null,null,null,null,null,null,null,null,null,null,null,null,null,null,null,null,null,null,null,null,null,null,null,null,null,null,null,null,null,null,null,null,null,null,null,"24"]
[null,null,null,null,null,null,null,null,null,null,null,null,null,"軽減税率対応見直し"]
[null,null,null,null,null,null,null,null,null,null,null,null,null,null,"V2･35請求明細、36支払明細",null,null,null,null,null,null,null,null,null,null,null,null,null,null,"トレーラレコードの",null,null,null,null,null,null,null,"税率別内訳の繰返部の推奨設定順序を追記",null,null,null,null,null,null,null,null,null,null,null,null,null,null,null,null,null,null,null,null,null,null,null,null,null,null,null,null,null,null,null,null,null,null,null,null,null,null,null,null,null,null,"30,34"]
[null,null,null,null,"2.3",null,null,"2019/06/07",null,null,null,null,null,"軽減税率対応見直し"]
[null,null,null,null,null,null,null,null,null,null,null,null,null,null,"V2・35請求明細、36支払明細",null,null,null,null,null,null,null,null,null,null,null,null,null,null,"トレーラレコードの",null,null,null,null,null,null,null,"請求合計金額,支払金額合計",null,null,null,null,null,null,null,null,null,null,null,null,null,"の項目説明・計算式の誤植修正。",null,null,null,null,null,null,null,null,null,null,null,null,null,null,null,null,null,null,null,null,null,null,null,null,null,null,null,null,"29,33,34"]
[null,null,null,null,null,null,null,null,null,null,null,null,null,null,null,null,null,null,null,null,null,null,null,null,null,null,null,null,null,"トレーラレコードの",null,null,null,null,null,null,null,"税率別内訳　の未使用ブロック設定の誤植修正。",null,null,null,null,null,null,null,null,null,null,null,null,null,null,null,null,null,null,null,null,null,null,null,null,null,null,null,null,null,null,null,null,null,null,null,null,null,null,null,null,null,null,"30,34"]
[null,null,null,null,"2.4",null,null,"2020/06/30",null,null,null,null,null,"電話番号への設定値の条件追加"]
[null,null,null,null,null,null,null,null,null,null,null,null,null,null,"Ｖ１・６４取引先コード照会／６７取引先コード照会結果",null,null,null,null,null,null,null,null,null,null,null,null,null,null,null,null,null,null,null,null,null,null,"電話番号　「携帯の電話番号は、登録不可」であることを追記",null,null,null,null,null,null,null,null,null,null,null,null,null,null,null,null,null,null,null,null,null,null,null,null,null,null,null,null,null,null,null,null,null,null,null,null,null,null,null,null,null,null,"12"]
[null,null,null,null,"2.5",null,null,"2021/2/5",null,null,null,null,null,"データ種削除"]
[null,null,null,null,null,null,null,null,null,null,null,null,null,null,"V1・33請求、V1・34支払",null,null,null,null,null,null,null,null,null,null,null,null,null,null,null,null,null,null,null,null,null,null,"データ種利用停止により削除"]
[null,null,null,null,"2.6",null,null,"2022/07/04",null,null,null,null,null,"インボイス対応"]
[null,null,null,null,null,null,null,null,null,null,null,null,null,null,"V1・22出荷報告",null,null,null,null,null,null,null,null,null,null,null,null,null,null,"明細部",null,null,null,null,null,null,null,"資産譲渡日付　を追加（項目追加に伴い、予備０４　を　資産譲渡日付　に変更）",null,null,null,null,null,null,null,null,null,null,null,null,null,null,null,null,null,null,null,null,null,null,null,null,null,null,null,null,null,null,null,null,null,null,null,null,null,null,null,null,null,null,"5"]
[null,null,null,null,null,null,null,null,null,null,null,null,null,null,"V2・18返品通知",null,null,null,null,null,null,null,null,null,null,null,null,null,null,"明細部",null,null,null,null,null,null,null,"資産譲渡日付　を追加",null,null,null,null,null,null,null,null,null,null,null,null,null,null,null,null,null,null,null,null,null,null,null,null,null,null,null,null,null,null,null,null,null,null,null,null,null,null,null,null,null,null,"19"]
[null,null,null,null,null,null,null,null,null,null,null,null,null,null,null,null,null,null,null,null,null,null,null,null,null,null,null,null,null,"明細部",null,null,null,null,null,null,null,"項目追加に伴い、明細連携エリア　の整数桁を変更",null,null,null,null,null,null,null,null,null,null,null,null,null,null,null,null,null,null,null,null,null,null,null,null,null,null,null,null,null,null,null,null,null,null,null,null,null,null,null,null,null,null,"19"]
[null,null,null,null,null,null,null,null,null,null,null,null,null,null,"V2・23出荷報告",null,null,null,null,null,null,null,null,null,null,null,null,null,null,"明細部",null,null,null,null,null,null,null,"資産譲渡日付　を追加",null,null,null,null,null,null,null,null,null,null,null,null,null,null,null,null,null,null,null,null,null,null,null,null,null,null,null,null,null,null,null,null,null,null,null,null,null,null,null,null,null,null,"22"]
[null,null,null,null,null,null,null,null,null,null,null,null,null,null,null,null,null,null,null,null,null,null,null,null,null,null,null,null,null,"明細部",null,null,null,null,null,null,null,"項目追加に伴い、明細連携エリア　の整数桁を変更",null,null,null,null,null,null,null,null,null,null,null,null,null,null,null,null,null,null,null,null,null,null,null,null,null,null,null,null,null,null,null,null,null,null,null,null,null,null,null,null,null,null,"22"]
[null,null,null,null,null,null,null,null,null,null,null,null,null,null,"V2・35請求明細",null,null,null,null,null,null,null,null,null,null,null,null,null,null,"ヘッダー部",null,null,null,null,null,null,null,"請求番号　を追加",null,null,null,null,null,null,null,null,null,null,null,null,null,null,null,null,null,null,null,null,null,null,null,null,null,null,null,null,null,null,null,null,null,null,null,null,null,null,null,null,null,null,"24"]
[null,null,null,null,null,null,null,null,null,null,null,null,null,null,null,null,null,null,null,null,null,null,null,null,null,null,null,null,null,"ヘッダー部",null,null,null,null,null,null,null,"項目追加に伴い、ヘッダー連携エリア　の整数桁を変更",null,null,null,null,null,null,null,null,null,null,null,null,null,null,null,null,null,null,null,null,null,null,null,null,null,null,null,null,null,null,null,null,null,null,null,null,null,null,null,null,null,null,"24"]
[null,null,null,null,null,null,null,null,null,null,null,null,null,null,null,null,null,null,null,null,null,null,null,null,null,null,null,null,null,"明細部",null,null,null,null,null,null,null,"資産譲渡日付　の項目説明を変更",null,null,null,null,null,null,null,null,null,null,null,null,null,null,null,null,null,null,null,null,null,null,null,null,null,null,null,null,null,null,null,null,null,null,null,null,null,null,null,null,null,null,"25"]
[null,null,null,null,null,null,null,null,null,null,null,null,null,null,null,null,null,null,null,null,null,null,null,null,null,null,null,null,null,"トレーラ部",null,null,null,null,null,null,null,"登録番号2　を追加",null,null,null,null,null,null,null,null,null,null,null,null,null,null,null,null,null,null,null,null,null,null,null,null,null,null,null,null,null,null,null,null,null,null,null,null,null,null,null,null,null,null,"26"]
[null,null,null,null,null,null,null,null,null,null,null,null,null,null,"V2・36支払明細",null,null,null,null,null,null,null,null,null,null,null,null,null,null,"ヘッダー部",null,null,null,null,null,null,null,"請求番号　を追加",null,null,null,null,null,null,null,null,null,null,null,null,null,null,null,null,null,null,null,null,null,null,null,null,null,null,null,null,null,null,null,null,null,null,null,null,null,null,null,null,null,null,"28"]
[null,null,null,null,null,null,null,null,null,null,null,null,null,null,null,null,null,null,null,null,null,null,null,null,null,null,null,null,null,"ヘッダー部",null,null,null,null,null,null,null,"項目追加に伴い、ヘッダー連携エリア　の整数桁を変更",null,null,null,null,null,null,null,null,null,null,null,null,null,null,null,null,null,null,null,null,null,null,null,null,null,null,null,null,null,null,null,null,null,null,null,null,null,null,null,null,null,null,"28"]
[null,null,null,null,null,null,null,null,null,null,null,null,null,null,null,null,null,null,null,null,null,null,null,null,null,null,null,null,null,"明細部",null,null,null,null,null,null,null,"資産譲渡日付　の項目説明を変更",null,null,null,null,null,null,null,null,null,null,null,null,null,null,null,null,null,null,null,null,null,null,null,null,null,null,null,null,null,null,null,null,null,null,null,null,null,null,null,null,null,null,"29"]
[null,null,null,null,null,null,null,null,null,null,null,null,null,null,null,null,null,null,null,null,null,null,null,null,null,null,null,null,null,"トレーラ部",null,null,null,null,null,null,null,"登録番号2　を追加",null,null,null,null,null,null,null,null,null,null,null,null,null,null,null,null,null,null,null,null,null,null,null,null,null,null,null,null,null,null,null,null,null,null,null,null,null,null,null,null,null,null,"30"]
[null,null,null,null,"2.7",null,null,"2023/05/24",null,null,null,null,null,"インボイス対応（追加）"]
[null,null,null,null,null,null,null,null,null,null,null,null,null,null,"V1・02発注",null,null,null,null,null,null,null,null,null,null,null,null,null,null,"ヘッダー部",null,null,null,null,null,null,null,"取引コード　に「81:ﾒｰｶｰ提供の役務」、「91:卸提供の役務」　を追加",null,null,null,null,null,null,null,null,null,null,null,null,null,null,null,null,null,null,null,null,null,null,null,null,null,null,null,null,null,null,null,null,null,null,null,null,null,null,null,null,null,null,"1"]
[null,null,null,null,null,null,null,null,null,null,null,null,null,null,"V1・11入庫予定",null,null,null,null,null,null,null,null,null,null,null,null,null,null,"ヘッダー部",null,null,null,null,null,null,null,"取引コード　に「81:ﾒｰｶｰ提供の役務」、「91:卸提供の役務」　を追加",null,null,null,null,null,null,null,null,null,null,null,null,null,null,null,null,null,null,null,null,null,null,null,null,null,null,null,null,null,null,null,null,null,null,null,null,null,null,null,null,null,null,"3"]
[null,null,null,null,null,null,null,null,null,null,null,null,null,null,"V1・22出荷報告",null,null,null,null,null,null,null,null,null,null,null,null,null,null,"ヘッダー部",null,null,null,null,null,null,null,"取引コード　に「81:ﾒｰｶｰ提供の役務」、「91:卸提供の役務」　を追加",null,null,null,null,null,null,null,null,null,null,null,null,null,null,null,null,null,null,null,null,null,null,null,null,null,null,null,null,null,null,null,null,null,null,null,null,null,null,null,null,null,null,"5"]
[null,null,null,null,null,null,null,null,null,null,null,null,null,null,"V2・03発注",null,null,null,null,null,null,null,null,null,null,null,null,null,null,"ヘッダー部",null,null,null,null,null,null,null,"取引コード　に「81:ﾒｰｶｰ提供の役務」、「91:卸提供の役務」　を追加",null,null,null,null,null,null,null,null,null,null,null,null,null,null,null,null,null,null,null,null,null,null,null,null,null,null,null,null,null,null,null,null,null,null,null,null,null,null,null,null,null,null,"9"]
[null,null,null,null,null,null,null,null,null,null,null,null,null,null,"V2・13入庫予定",null,null,null,null,null,null,null,null,null,null,null,null,null,null,"ヘッダー部",null,null,null,null,null,null,null,"取引コード　に「81:ﾒｰｶｰ提供の役務」、「91:卸提供の役務」　を追加",null,null,null,null,null,null,null,null,null,null,null,null,null,null,null,null,null,null,null,null,null,null,null,null,null,null,null,null,null,null,null,null,null,null,null,null,null,null,null,null,null,null,"12"]
[null,null,null,null,null,null,null,null,null,null,null,null,null,null,"V2・14受領",null,null,null,null,null,null,null,null,null,null,null,null,null,null,"ヘッダー部",null,null,null,null,null,null,null,"取引コード　に「81:ﾒｰｶｰ提供の役務」、「91:卸提供の役務」　を追加",null,null,null,null,null,null,null,null,null,null,null,null,null,null,null,null,null,null,null,null,null,null,null,null,null,null,null,null,null,null,null,null,null,null,null,null,null,null,null,null,null,null,"15"]
[null,null,null,null,null,null,null,null,null,null,null,null,null,null,"V2・18返品通知",null,null,null,null,null,null,null,null,null,null,null,null,null,null,"ヘッダー部",null,null,null,null,null,null,null,"取引コード　に「81:ﾒｰｶｰ提供の役務」、「91:卸提供の役務」　を追加",null,null,null,null,null,null,null,null,null,null,null,null,null,null,null,null,null,null,null,null,null,null,null,null,null,null,null,null,null,null,null,null,null,null,null,null,null,null,null,null,null,null,"18"]
[null,null,null,null,null,null,null,null,null,null,null,null,null,null,"V2・23出荷報告",null,null,null,null,null,null,null,null,null,null,null,null,null,null,"ヘッダー部",null,null,null,null,null,null,null,"取引コード　に「81:ﾒｰｶｰ提供の役務」、「91:卸提供の役務」　を追加",null,null,null,null,null,null,null,null,null,null,null,null,null,null,null,null,null,null,null,null,null,null,null,null,null,null,null,null,null,null,null,null,null,null,null,null,null,null,null,null,null,null,"20"]
[null,null,null,null,null,null,null,null,null,null,null,null,null,null,"V2・35請求明細",null,null,null,null,null,null,null,null,null,null,null,null,null,null,"ヘッダー部",null,null,null,null,null,null,null,"取引コード　に「81:ﾒｰｶｰ提供の役務」、「91:卸提供の役務」　を追加",null,null,null,null,null,null,null,null,null,null,null,null,null,null,null,null,null,null,null,null,null,null,null,null,null,null,null,null,null,null,null,null,null,null,null,null,null,null,null,null,null,null,"23"]
[null,null,null,null,null,null,null,null,null,null,null,null,null,null,null,null,null,null,null,null,null,null,null,null,null,null,null,null,null,"明細部",null,null,null,null,null,null,null,"資産譲渡日付　の項目説明に「※「資産譲渡日付区分」が『１：年月形式』の場合、「YYYYMM00」を設定」　を追記",null,null,null,null,null,null,null,null,null,null,null,null,null,null,null,null,null,null,null,null,null,null,null,null,null,null,null,null,null,null,null,null,null,null,null,null,null,null,null,null,null,null,"25"]
[null,null,null,null,null,null,null,null,null,null,null,null,null,null,"V2・36支払明細",null,null,null,null,null,null,null,null,null,null,null,null,null,null,"ヘッダー部",null,null,null,null,null,null,null,"取引コード　に「81:ﾒｰｶｰ提供の役務」、「91:卸提供の役務」　を追加",null,null,null,null,null,null,null,null,null,null,null,null,null,null,null,null,null,null,null,null,null,null,null,null,null,null,null,null,null,null,null,null,null,null,null,null,null,null,null,null,null,null,"27"]
[null,null,null,null,null,null,null,null,null,null,null,null,null,null,null,null,null,null,null,null,null,null,null,null,null,null,null,null,null,"明細部",null,null,null,null,null,null,null,"資産譲渡日付　の項目説明に「※「資産譲渡日付区分」が『１：年月形式』の場合、「YYYYMM00」を設定」　を追記",null,null,null,null,null,null,null,null,null,null,null,null,null,null,null,null,null,null,null,null,null,null,null,null,null,null,null,null,null,null,null,null,null,null,null,null,null,null,null,null,null,null,"29"]
[null,null,null,null,null,null,null,null,null,null,null,null,null,null,"V2・43販売報告",null,null,null,null,null,null,null,null,null,null,null,null,null,null,"ヘッダー部",null,null,null,null,null,null,null,"取引コード　に「81:ﾒｰｶｰ提供の役務」、「91:卸提供の役務」　を追加",null,null,null,null,null,null,null,null,null,null,null,null,null,null,null,null,null,null,null,null,null,null,null,null,null,null,null,null,null,null,null,null,null,null,null,null,null,null,null,null,null,null,"31"]
[null,null,null,null,"2.8",null,null,"2023/07/14",null,null,null,null,null,"インボイス対応（変更）"]
[null,null,null,null,null,null,null,null,null,null,null,null,null,null,"V1・22出荷報告",null,null,null,null,null,null,null,null,null,null,null,null,null,null,"トレーラ部",null,null,null,null,null,null,null,"資産譲渡日付　の項目位置を末尾（改行コード前）に変更",null,null,null,null,null,null,null,null,null,null,null,null,null,null,null,null,null,null,null,null,null,null,null,null,null,null,null,null,null,null,null,null,null,null,null,null,null,null,null,null,null,null,"6"]
[null,null,null,null,null,null,null,null,null,null,null,null,null,null,null,null,null,null,null,null,null,null,null,null,null,null,null,null,null,"トレーラ部",null,null,null,null,null,null,null,"資産譲渡日付　の属性を(9)から(X)に変更、V1→V2センタチェック「属性(ｽ)」を削除",null,null,null,null,null,null,null,null,null,null,null,null,null,null,null,null,null,null,null,null,null,null,null,null,null,null,null,null,null,null,null,null,null,null,null,null,null,null,null,null,null,null,"6"]
[null,null,null,null,null,null,null,null,null,null,null,null,null,null,null,null,null,null,null,null,null,null,null,null,null,null,null,null,null,"明細部",null,null,null,null,null,null,null,"資産譲渡日付　の項目位置変更に伴い、予備０４　に戻す",null,null,null,null,null,null,null,null,null,null,null,null,null,null,null,null,null,null,null,null,null,null,null,null,null,null,null,null,null,null,null,null,null,null,null,null,null,null,null,null,null,null,"6"]
[null,null,null,null,null,null,null,null,null,null,null,null,null,null,"V2・18返品通知",null,null,null,null,null,null,null,null,null,null,null,null,null,null,"トレーラ部",null,null,null,null,null,null,null,"資産譲渡日付　の項目位置を末尾（改行コード前）に変更",null,null,null,null,null,null,null,null,null,null,null,null,null,null,null,null,null,null,null,null,null,null,null,null,null,null,null,null,null,null,null,null,null,null,null,null,null,null,null,null,null,null,"19"]
[null,null,null,null,null,null,null,null,null,null,null,null,null,null,null,null,null,null,null,null,null,null,null,null,null,null,null,null,null,"トレーラ部",null,null,null,null,null,null,null,"資産譲渡日付　の属性を(9)から(X)に変更、V2→V1・V2センタチェック「属性」を削除",null,null,null,null,null,null,null,null,null,null,null,null,null,null,null,null,null,null,null,null,null,null,null,null,null,null,null,null,null,null,null,null,null,null,null,null,null,null,null,null,null,null,"19"]
[null,null,null,null,null,null,null,null,null,null,null,null,null,null,null,null,null,null,null,null,null,null,null,null,null,null,null,null,null,"明細部",null,null,null,null,null,null,null,"資産譲渡日付　の項目位置変更に伴い、明細連携エリア　の整数桁を変更",null,null,null,null,null,null,null,null,null,null,null,null,null,null,null,null,null,null,null,null,null,null,null,null,null,null,null,null,null,null,null,null,null,null,null,null,null,null,null,null,null,null,"19"]
[null,null,null,null,null,null,null,null,null,null,null,null,null,null,"V2・23出荷報告",null,null,null,null,null,null,null,null,null,null,null,null,null,null,"トレーラ部",null,null,null,null,null,null,null,"資産譲渡日付　の項目位置を末尾（改行コード前）に変更",null,null,null,null,null,null,null,null,null,null,null,null,null,null,null,null,null,null,null,null,null,null,null,null,null,null,null,null,null,null,null,null,null,null,null,null,null,null,null,null,null,null,"22"]
[null,null,null,null,null,null,null,null,null,null,null,null,null,null,null,null,null,null,null,null,null,null,null,null,null,null,null,null,null,"トレーラ部",null,null,null,null,null,null,null,"資産譲渡日付　の属性を(9)から(X)に変更、V2→V1・V2センタチェック「属性」を削除",null,null,null,null,null,null,null,null,null,null,null,null,null,null,null,null,null,null,null,null,null,null,null,null,null,null,null,null,null,null,null,null,null,null,null,null,null,null,null,null,null,null,"22"]
[null,null,null,null,null,null,null,null,null,null,null,null,null,null,null,null,null,null,null,null,null,null,null,null,null,null,null,null,null,"明細部",null,null,null,null,null,null,null,"資産譲渡日付　の項目位置変更に伴い、明細連携エリア　の整数桁を変更",null,null,null,null,null,null,null,null,null,null,null,null,null,null,null,null,null,null,null,null,null,null,null,null,null,null,null,null,null,null,null,null,null,null,null,null,null,null,null,null,null,null,"22"]
[null,null,null,null,null,null,null,null,null,null,null,null,null,null,"V2・35請求明細",null,null,null,null,null,null,null,null,null,null,null,null,null,null,"トレーラ部",null,null,null,null,null,null,null,"ヘッダー部の　請求番号　の項目位置を末尾（改行コード前）に変更",null,null,null,null,null,null,null,null,null,null,null,null,null,null,null,null,null,null,null,null,null,null,null,null,null,null,null,null,null,null,null,null,null,null,null,null,null,null,null,null,null,null,"26"]
[null,null,null,null,null,null,null,null,null,null,null,null,null,null,null,null,null,null,null,null,null,null,null,null,null,null,null,null,null,"トレーラ部",null,null,null,null,null,null,null,"請求番号　のV2→V1・V2センタチェック「属性」を削除",null,null,null,null,null,null,null,null,null,null,null,null,null,null,null,null,null,null,null,null,null,null,null,null,null,null,null,null,null,null,null,null,null,null,null,null,null,null,null,null,null,null,"26"]
[null,null,null,null,null,null,null,null,null,null,null,null,null,null,null,null,null,null,null,null,null,null,null,null,null,null,null,null,null,"ヘッダー部",null,null,null,null,null,null,null,"請求番号　の項目位置変更に伴い、ヘッダー連携エリア　の整数桁を変更",null,null,null,null,null,null,null,null,null,null,null,null,null,null,null,null,null,null,null,null,null,null,null,null,null,null,null,null,null,null,null,null,null,null,null,null,null,null,null,null,null,null,"24"]
[]
[null,null,null,null,"（次頁に続く）"]
[]
[]
[]
[null,null,null,null,"（前頁の続き）"]
[null,null,null,null,"版数",null,null,null,"更新年月日",null,null,null,null,null,null,"更新概要",null,null,null,null,null,null,null,null,null,null,null,null,null,null,null,null,null,null,null,null,null,null,null,null,null,null,null,null,null,null,null,null,null,null,null,null,null,null,null,null,null,null,null,null,null,null,null,null,null,null,null,null,null,null,null,null,null,null,null,null,null,null,null,null,"ページ"]
[null,null,null,null,null,null,null,null,null,null,null,null,null,null,"V2・36支払明細",null,null,null,null,null,null,null,null,null,null,null,null,null,null,"トレーラ部",null,null,null,null,null,null,null,"ヘッダー部の　請求番号　の項目位置を末尾（改行コード前）に変更",null,null,null,null,null,null,null,null,null,null,null,null,null,null,null,null,null,null,null,null,null,null,null,null,null,null,null,null,null,null,null,null,null,null,null,null,null,null,null,null,null,null,"30"]
[null,null,null,null,null,null,null,null,null,null,null,null,null,null,null,null,null,null,null,null,null,null,null,null,null,null,null,null,null,"トレーラ部",null,null,null,null,null,null,null,"請求番号　のV2→V1・V2センタチェック「属性」を削除",null,null,null,null,null,null,null,null,null,null,null,null,null,null,null,null,null,null,null,null,null,null,null,null,null,null,null,null,null,null,null,null,null,null,null,null,null,null,null,null,null,null,"30"]
[null,null,null,null,null,null,null,null,null,null,null,null,null,null,null,null,null,null,null,null,null,null,null,null,null,null,null,null,null,"ヘッダー部",null,null,null,null,null,null,null,"請求番号　の項目位置変更に伴い、ヘッダー連携エリア　の整数桁を変更",null,null,null,null,null,null,null,null,null,null,null,null,null,null,null,null,null,null,null,null,null,null,null,null,null,null,null,null,null,null,null,null,null,null,null,null,null,null,null,null,null,null,"28"]

{"sheet":"目次","index":2,"n_rows":50,"n_cols":96,"rows_kept":50,"cut":false,"hidden":false,"merged":[[55,6,55,9],[16,6,16,9],[63,77,63,89],[59,30,59,60],[34,59,34,60],[36,59,36,60],[38,59,38,60],[40,59,40,60],[47,6,47,9],[47,59,47,60],[49,6,49,9],[49,59,49,60],[40,6,40,9],[34,6,34,9],[36,6,36,9],[38,6,38,9],[14,6,14,9],[10,6,10,9],[12,6,12,9],[26,59,26,60],[28,59,28,60],[12,59,12,60],[10,59,10,60],[16,59,16,60],[14,59,14,60],[26,6,26,9],[28,6,28,9],[18,59,18,60],[30,6,30,9],[30,59,30,60],[32,6,32,9],[32,59,32,60],[18,6,18,9]]}
[]
[]
[]
[null,null,null,null,null,"目次"]
[null,null,null,null,null,null,null,null,null,null,null,null,null,null,null,null,null,null,null,null,null,null,null,null,null,null,null,null,null,null,null,null,null,null,null,null,null,null,null,null,null,null,null,null,null,null,null,null,null,null,null,null,null,null,null,null,null,null,null,null,null,null,null,null,null,null,null,null,null,null,null,null,null,null,null,null,"　"]
[]
[null,null,null,null,null,"１．",null,null,"Ｖ１・Web-EDIフォーマット"]
[]
[null,null,null,null,null,null,"１．１",null,null,null,"Ｖ１・ＣＳＶフォーマット"]
[]
[null,null,null,null,null,null,"（１）",null,null,null,null,"０２発注データ",null,null,null,null,null,null,null,null,null,null,null,"・","・","・","・","・","・","・","・","・","・","・","・","・","・","・","・","・","・","・","・","・","・","・","・","・","・","・","・","・","・","・","・","・","・","・",null,1,null,null,null,null,null,null,null,null,null,null,null,null,null,null,null,null,null,null,null,null,null,null,null,null,null,null,null,null,null,null,null,null,null,null,null,{"$f":"'０２発注'!$AD$1","v":{"$error":"#VALUE!"}}]
[]
[null,null,null,null,null,null,"（２）",null,null,null,null,"１１入庫予定データ",null,null,null,null,null,null,null,null,null,null,null,"・","・","・","・","・","・","・","・","・","・","・","・","・","・","・","・","・","・","・","・","・","・","・","・","・","・","・","・","・","・","・","・","・","・","・",null,3,null,null,null,null,null,null,null,null,null,null,null,null,null,null,null,null,null,null,null,null,null,null,null,null,null,null,null,null,null,null,null,null,null,null,null,{"$f":"'１１入庫予定'!$AD$1","v":{"$error":"#VALUE!"}}]
[]
[null,null,null,null,null,null,"（３）",null,null,null,null,"２２出荷報告(直送)データ",null,null,null,null,null,null,null,null,null,null,null,"・","・","・","・","・","・","・","・","・","・","・","・","・","・","・","・","・","・","・","・","・","・","・","・","・","・","・","・","・","・","・","・","・","・","・",null,5,null,null,null,null,null,null,null,null,null,null,null,null,null,null,null,null,null,null,null,null,null,null,null,null,null,null,null,null,null,null,null,null,null,null,null,{"$f":"'２２出荷報告'!$AD$1","v":{"$error":"#VALUE!"}}]
[]
[null,null,null,null,null,null,"（４）",null,null,null,null,"４２販売報告(店出し)データ",null,null,null,null,null,null,null,null,null,null,null,"・","・","・","・","・","・","・","・","・","・","・","・","・","・","・","・","・","・","・","・","・","・","・","・","・","・","・","・","・","・","・","・","・","・","・",null,7,null,null,null,null,null,null,null,null,null,null,null,null,null,null,null,null,null,null,null,null,null,null,null,null,null,null,null,null,null,null,null,null,null,null,null,{"$f":"'４２販売報告'!$AD$1","v":{"$error":"#VALUE!"}}]
[]
[null,null,null,null,null,null,"（５）",null,null,null,null,"６４取引先コード照会／",null,null,null,null,null,null,null,null,null,null,null,"・","・","・","・","・","・","・","・","・","・","・","・","・","・","・","・","・","・","・","・","・","・","・","・","・","・","・","・","・","・","・","・","・","・","・",null,8,null,null,null,null,null,null,null,null,null,null,null,null,null,null,null,null,null,null,null,null,null,null,null,null,null,null,null,null,null,null,null,null,null,null,null,{"$f":"'６４取引先コード照会 ・６７取引先コード照会結果'!$AD$1","v":{"$error":"#VALUE!"}}]
[null,null,null,null,null,null,null,null,null,null,null,"６７取引先コード照会結果"]
[]
[]
[null,null,null,null,null,"２．",null,null,"Ｖ２・Web-EDIフォーマット"]
[]
[null,null,null,null,null,null,"２．１",null,null,null,"Ｖ２・ＣＳＶフォーマット"]
[]
[null,null,null,null,null,null,"（１）",null,null,null,null,"０３発注データ",null,null,null,null,null,null,null,null,null,null,null,"・","・","・","・","・","・","・","・","・","・","・","・","・","・","・","・","・","・","・","・","・","・","・","・","・","・","・","・","・","・","・","・","・","・","・",null,9,null,null,null,null,null,null,null,null,null,null,null,null,null,null,null,null,null,null,null,null,null,null,null,null,null,null,null,null,null,null,null,null,null,null,null,{"$f":"'０３発注'!$AF$1","v":{"$error":"#VALUE!"}}]
[]
[null,null,null,null,null,null,"（２）",null,null,null,null,"１３入庫予定データ",null,null,null,null,null,null,null,null,null,null,null,"・","・","・","・","・","・","・","・","・","・","・","・","・","・","・","・","・","・","・","・","・","・","・","・","・","・","・","・","・","・","・","・","・","・","・",null,"12",null,null,null,null,null,null,null,null,null,null,null,null,null,null,null,null,null,null,null,null,null,null,null,null,null,null,null,null,null,null,null,null,null,null,null,{"$f":"'１３入庫予定'!$AF$1","v":{"$error":"#VALUE!"}}]
[]
[null,null,null,null,null,null,"（３）",null,null,null,null,"１４受領データ",null,null,null,null,null,null,null,null,null,null,null,"・","・","・","・","・","・","・","・","・","・","・","・","・","・","・","・","・","・","・","・","・","・","・","・","・","・","・","・","・","・","・","・","・","・","・",null,"15",null,null,null,null,null,null,null,null,null,null,null,null,null,null,null,null,null,null,null,null,null,null,null,null,null,null,null,null,null,null,null,null,null,null,null,{"$f":"'１４受領'!$AF$1","v":{"$error":"#VALUE!"}}]
[]
[null,null,null,null,null,null,"（４）",null,null,null,null,"１８返品通知データ",null,null,null,null,null,null,null,null,null,null,null,"・","・","・","・","・","・","・","・","・","・","・","・","・","・","・","・","・","・","・","・","・","・","・","・","・","・","・","・","・","・","・","・","・","・","・",null,"18",null,null,null,null,null,null,null,null,null,null,null,null,null,null,null,null,null,null,null,null,null,null,null,null,null,null,null,null,null,null,null,null,null,null,null,{"$f":"'１８返品通知'!$AF$1","v":{"$error":"#VALUE!"}}]
[]
[null,null,null,null,null,null,"（５）",null,null,null,null,"２３出荷報告データ",null,null,null,null,null,null,null,null,null,null,null,"・","・","・","・","・","・","・","・","・","・","・","・","・","・","・","・","・","・","・","・","・","・","・","・","・","・","・","・","・","・","・","・","・","・","・",null,"20",null,null,null,null,null,null,null,null,null,null,null,null,null,null,null,null,null,null,null,null,null,null,null,null,null,null,null,null,null,null,null,null,null,null,null,{"$f":"'２３出荷報告'!$AF$1","v":{"$error":"#VALUE!"}}]
[]
[null,null,null,null,null,null,"（６）",null,null,null,null,"３５請求明細データ",null,null,null,null,null,null,null,null,null,null,null,"・","・","・","・","・","・","・","・","・","・","・","・","・","・","・","・","・","・","・","・","・","・","・","・","・","・","・","・","・","・","・","・","・","・","・",null,"23",null,null,null,null,null,null,null,null,null,null,null,null,null,null,null,null,null,null,null,null,null,null,null,null,null,null,null,null,null,null,null,null,null,null,null,{"$f":"'３５請求明細'!$AF$1","v":{"$error":"#VALUE!"}}]
[]
[null,null,null,null,null,null,"（７）",null,null,null,null,"３６支払明細データ",null,null,null,null,null,null,null,null,null,null,null,"・","・","・","・","・","・","・","・","・","・","・","・","・","・","・","・","・","・","・","・","・","・","・","・","・","・","・","・","・","・","・","・","・","・","・",null,"27",null,null,null,null,null,null,null,null,null,null,null,null,null,null,null,null,null,null,null,null,null,null,null,null,null,null,null,null,null,null,null,null,null,null,null,{"$f":"'３６支払明細'!$AG$1","v":{"$error":"#VALUE!"}}]
[]
[null,null,null,null,null,null,"（８）",null,null,null,null,"４３販売報告データ",null,null,null,null,null,null,null,null,null,null,null,"・","・","・","・","・","・","・","・","・","・","・","・","・","・","・","・","・","・","・","・","・","・","・","・","・","・","・","・","・","・","・","・","・","・","・",null,"31",null,null,null,null,null,null,null,null,null,null,null,null,null,null,null,null,null,null,null,null,null,null,null,null,null,null,null,null,null,null,null,null,null,null,null,{"$f":"'４３販売報告'!$AG$1","v":{"$error":"#VALUE!"}}]
[]
[]
[null,null,null,null,null,"３．",null,null,"共通・Web-EDIフォーマット"]
[]
[null,null,null,null,null,null,"３．１",null,null,null,"共通・ＣＳＶフォーマット"]
[]
[null,null,null,null,null,null,"（１）",null,null,null,null,"集配信状況照会ダウンロード",null,null,null,null,null,null,null,null,null,null,null,"・","・","・","・","・","・","・","・","・","・","・","・","・","・","・","・","・","・","・","・","・","・","・","・","・","・","・","・","・","・","・","・","・","・","・",null,"33",null,null,null,null,null,null,null,null,null,null,null,null,null,null,null,null,null,null,null,null,null,null,null,null,null,null,null,null,null,null,null,null,null,null,null,{"$f":"集配信状況照会!$AL$1","v":{"$error":"#VALUE!"}}]
[]
[null,null,null,null,null,null,"（２）",null,null,null,null,"エンドレコード",null,null,null,null,null,null,null,null,null,null,null,"・","・","・","・","・","・","・","・","・","・","・","・","・","・","・","・","・","・","・","・","・","・","・","・","・","・","・","・","・","・","・","・","・","・","・",null,"34",null,null,null,null,null,null,null,null,null,null,null,null,null,null,null,null,null,null,null,null,null,null,null,null,null,null,null,null,null,null,null,null,null,null,null,{"$f":"エンドレコード!$AL$1","v":{"$error":"#VALUE!"}}]

{"sheet":"０２発注","index":3,"n_rows":126,"n_cols":37,"rows_kept":126,"cut":false,"hidden":false,"merged":[[45,6,46,6],[45,7,46,7],[4,3,5,4],[45,23,45,27],[45,8,46,8],[45,9,46,9],[45,10,46,10],[45,16,46,16],[45,1,46,1],[45,2,46,2],[4,34,5,34],[4,35,5,35],[4,36,5,36],[4,23,4,27],[35,13,35,17],[4,2,5,2],[4,1,5,1],[4,10,5,10],[4,16,5,16],[4,6,5,6],[4,9,5,9],[4,7,5,7],[4,8,5,8],[45,3,46,4],[67,10,67,15],[50,16,50,17],[61,33,62,33],[61,34,62,34],[61,35,62,35],[61,36,62,36],[4,29,5,29],[4,30,5,31],[61,29,62,29],[61,30,62,31],[4,33,5,33],[113,36,114,36],[113,29,114,29],[113,30,114,31],[113,33,114,33],[113,34,114,34],[113,35,114,35]]}
["　１． Ｖ１・Web-EDIフォーマット",null,null,null,null,null,null,null,null,null,null,null,null,null,null,null,null,null,null,null,null,null,null,null,null,null,null,null,null,{"$f":"シート別総ページ数","v":{"$error":"#NAME?"}}]
["　　　１.１  Ｖ１・ＣＳＶフォーマット"]
[null,null,"（１） Ｖ１・０２発注",null,null,null,null,null,null,null,null,null,null,null,null,null,null,null,null,null,null,null,null,null,null,null,null,null,null,"（１） Ｖ２・０３発注"]
[null,null,null,null,null,null,null,null,null,null,null,null,null,null,null,null,null,null,null,null,null,null,null,null,null,null,null,null,null,"　"]
[null,"変更","項番","　項目",null,null,"属性","整数桁","小数桁","必須","　項目説明",null,null,null,null,null,"　コード",null,"アップロード","Ｖ１ → Ｖ１","Ｖ１ → Ｖ２","Ｖ１ ← Ｖ１","Ｖ１ ← Ｖ２","　　　　　　　Ｖ２フォーマット",null,null,null,null,null,"項番","　項目",null,null,"属性","整数桁","小数桁","必須"]
[null,null,null,null,null,null,null,null,null,null,null,null,null,null,null,null,null,null,"チェック","センタチェック","センタチェック","コンバート","コンバート","項番","　　項目","属性","整数","小数"]
[null,null,"1","データ種別",null,null,"9",2,null,"◎","０２：受発注データ",null,null,null,null,null,"02",null,"必須","ｺｰﾄﾞ","ｺｰﾄﾞ","○","\"02”固定",null,{"$f":"IF($X7=\"\",\"\",VLOOKUP($X7,$AD$7:$AK$16,2,))","v":""},{"$f":"IF($X7=\"\",\"\",VLOOKUP($X7,$AD$7:$AK$16,6,))","v":""},{"$f":"IF($X7=\"\",\"\",VLOOKUP($X7,$AD$7:$AK$16,7,))","v":""},{"$f":"IF($X7=\"\",\"\",VLOOKUP($X7,$AD$7:$AK$16,8,))","v":""},null,"1","データ種別",null,null,9,2,null,"◎"]
[null,null,"2","最終トレーラ判定区分",null,null,"X",1,null,"◎","トレーラ判定の区分",null,null,null,null,null,"9:最終","△:それ以外",null,null,null,null,"○","2",{"$f":"IF($X8=\"\",\"\",VLOOKUP($X8,$AD$7:$AL$128,2,))","v":"最終トレーラ判定区分"},{"$f":"IF($X8=\"\",\"\",VLOOKUP($X8,$AD$7:$AL$128,5,))","v":"X"},{"$f":"IF($X8=\"\",\"\",VLOOKUP($X8,$AD$7:$AL$128,6,))","v":1},{"$f":"IF($X8=\"\",\"\",VLOOKUP($X8,$AD$7:$AL$128,7,))","v":0},null,"2","最終トレーラ判定区分",null,null,"X",1,null,"◎"]
[null,null,"3","送信先コード",null,null,"9",8,null,"◎","送信先(メーカ)","の統一取引先コード",null,null,null,null,null,null,"必須＋属性＋桁数＋登録","センター登録","センター登録",null,"○","3","送信先コード",9,8,0,null,"3","送信先コード",null,null,9,8,null,"◎"]
[null,null,"4","送信元コード",null,null,"9",8,null,"◎","送信元(卸)     ","の統一取引先コード",null,null,null,null,null,null,"必須＋属性＋桁数＋登録","センター登録","センター登録",null,"○","4","送信元コード",9,8,0,null,"4","送信元コード",null,null,9,8,null,"◎"]
[null,null,"5","データ作成日",null,null,"9",8,null,"○","本データを作成した日付",null,"(西暦 YYYYMMDD)",null,null,null,null,null,null,null,"必須＋日付","○","○","5","データ作成日",9,8,0,null,"5","データ作成日",null,null,9,8,null,"◎"]
[null,null,"6","送信先名",null,null,"X",20,null,"○","送信先(メーカ)","のカナ名称",null,null,null,null,null,null,"属性",null,null,"○","○","7","送信先名","X",20,0,null,"6","データ作成時刻",null,null,9,6]
[null,null,"7","送信元名",null,null,"X",20,null,"○","送信元(卸)","のカナ名称",null,null,null,null,null,null,"属性",null,"必須","○","○","8","送信元名","X",20,0,null,"7","送信先名",null,null,"X",20]
[null,null,"8","直接送信先コード",null,null,"9",8,null,null,"送信先と異なる場所へ送信する場合にセット。　セット不要の場合\"00000000\"",null,null,null,null,null,null,null,null,"センター登録","センター登録","○","○","9","直接送信先コード",9,8,0,null,"8","送信元名",null,null,"X",20,null,"◎"]
[null,null,"9","直接送信先カナ名",null,null,"X",20,null,null,"送信先と異なる場所へ送信する場合にセット。　セット不要の場合スペース",null,null,null,null,null,null,null,"属性",null,null,"○","○","10","直接送信先名","X",20,0,null,"9","直接送信先コード",null,null,9,8]
[null,null,"10","予備０１",null,null,"X",161,null,null,"新フォーマット連携エリア間のデータ連携",null,null,null,null,null,null,null,null,null,null,"○","○","12","連携エリア","X",20,0,null,"10","直接送信先名",null,null,"X",20]
[null,null,"11","卸伝票NO",null,null,"9",6,null,"◎","発注NO",null,null,null,null,null,null,null,"必須＋属性＋桁数",null,"必須＋属性(ｽ)","○","下６桁","13","卸発注伝票NO",9,8,0,null,"11","送信ファイルNO",null,null,9,2]
[null,null,"12","店入直送区分",null,null,"9",1,null,"○","店(倉)入れまたは直送等の区分",null,null,null,null,null,"1:店入\n","2:直送",null,null,"必須＋ｺｰﾄﾞ","○","\"1\"･\"3\" → \"1\"\n その他   → \"2\"","14","店入直送区分",9,1,0,null,"12","連携エリア",null,null,"X",20]
[null,2.7,"13","取引コード",null,null,"9",2,null,"○","業界統一取引コード",null,null,null,null,null,"11:店入売上\n12:店入売上訂正\n21:店入返品\n22:店入返品訂正\n31:直送売上\n32:直送売上訂正\n\n\n\n","41:直送返品\n42:直送返品訂正\n51:割戻し金\n52:相殺\n81:ﾒｰｶｰ提供の役務\n91:卸提供の役務",null,null,"必須＋ｺｰﾄﾞ","○","○","15","取引コード",9,2,0,null,"13","卸発注伝票NO",null,null,9,8,null,"◎"]
[null,null,"14","納品日",null,null,"9",8,null,"○","卸売業が指定した納品日(着荷日)",null,"(西暦 YYYYMMDD)",null,null,null,null,null,"属性＋桁数",null,"必須＋日付","○","○","16","納品日／引取日",9,8,0,null,"14","店入直送区分",null,null,9,1,null,"◎"]
[null,null,"15","納入時間",null,null,"9",4,null,null,"卸売業が指定した納品時間(時分)",null,"(HHMM)",null,null,null,null,null,null,null,null,"○","○","17","納入時間（自）",9,4,0,null,"15","取引コード",null,null,9,2,null,"◎"]
[null,null,"16","明細行数",null,null,"9",2,null,"○","伝票内明細数",null,null,null,null,null,null,null,null,null,"属性(ｽ)","○","○","20","明細行数",9,2,0,null,"16","納品日／引取日",null,null,9,8,null,"◎"]
[null,"2.2","17","一次店コード",null,null,"9",8,null,"○","該当する統一取引先コード",null,null,null,null,null,null,null,"属性＋桁数",null,"必須","○","8桁以上:上8桁","21","一次店コード","X",13,0,null,"17","納入時間（自）",null,null,9,4]
[null,"2.2","18","二次店コード",null,null,"9",8,null,null,"該当する統一取引先コード",null,null,null,null,null,null,null,"属性＋桁数",null,null,"○","8桁未満:前ゼロ＋有効桁","22","二次店コード","X",13,0,null,"18","納入時間（至）",null,null,9,4]
[null,"2.2","19","届け先コード",null,null,"9",8,null,"○","該当する統一取引先コード",null,"(一次店、二次店と重複しても必ずセットする)",null,null,null,null,null,"属性＋桁数",null,null,"○","　　　　　　　　　　　","24","届け先コード","X",13,0,null,"19","発注日",null,null,9,8]
[null,null,"20","専用伝票日付",null,null,"9",8,null,null,"納品伝票が専用伝票の場合にセット",null,"(西暦 YYYYMMDD、セット不要の場合はゼロ)",null,null,null,null,null,null,null,"日付","○","○","26","専用伝票日付",9,8,0,null,"20","明細行数",null,null,9,2,null,"○"]
[null,null,"21","専用伝票NO",null,null,"9",9,null,null,"納品伝票が専用伝票の場合にセット",null,"(セット不要の場合はゼロ)",null,null,null,null,null,null,null,"属性(ｽ)","○","○","27","専用伝票NO",9,9,0,null,"21","一次店コード",null,null,"X",13,null,"◎"]
[null,null,"22","伝票合計金額符号",null,null,"X",1,null,"○","伝票の合計金額の符号",null,null,null,null,null,"＋:正数","－:負数","属性",null,null,"\"△\" → \"+\"","\"△\" → \"+\"","28","伝票合計金額符号","X",1,0,null,"22","二次店コード",null,null,"X",13]
[null,null,"23","伝票合計金額",null,null,"9",8,null,"○","伝票の合計金額",null,"(卸店入価格)",null,null,null,null,null,"属性＋桁数","属性(ｻ)","属性(ｽ)","○","○","29","伝票合計金額",9,8,0,null,"23","三次店コード",null,null,"X",13]
[null,null,"24","二次店納入合計符号",null,null,"X",1,null,null,"正味納入金額の符号",null,null,null,null,null,"＋:正数","－:負数","属性",null,null,"\"△\" → \"+\"","\"△\" → \"+\"","30","二次店納入合計金額符号","X",1,0,null,"24","届け先コード",null,null,"X",13,null,"○"]
[null,null,"25","二次店納入合計金額",null,null,"9",8,null,null,"正味納入金額",null,null,null,null,null,null,null,"属性＋桁数","属性(ｻ)","属性(ｽ)","○","○","31","二次店納入合計金額",9,8,0,null,"25","チェーン店コード",null,null,"X",13]
[null,1.1000000000000001,"26","一次店カナ名",null,null,"X",30,null,"○","一次店名",null,null,null,null,null,null,null,"属性",null,null,"○","日本語区分(一次店)が\n漢字  ：一次店カナ名\nその他：一次店名","32\n100","一次店名\n一次店カナ名","X/N\nX","40\n30",0,null,"26","専用伝票日付",null,null,9,8]
[null,1.1000000000000001,"27","二次店カナ名",null,null,"X",30,null,null,"二次店名",null,null,null,null,null,null,null,"属性",null,null,"○","日本語区分(二次店)が\n漢字  ：二次店カナ名\nその他：二次店名","33\n101","二次店名\n二次店カナ名","X/N\nX","40\n30",0,null,"27","専用伝票NO",null,null,9,9]
[null,1.1000000000000001,"28","届け先カナ名",null,null,"X",30,null,"○","届け先名",null,null,null,null,null,null,null,"属性",null,null,"○","日本語区分(届け先)が\n漢字  ：届け先カナ名\nその他：届け先名","35\n102","届け先名\n届け先カナ名","X/N\nX","40\n30",0,null,"28","伝票合計金額符号",null,null,"X",1,null,"○"]
[null,null,"29","メーカ所属組織名",null,null,"X",10,null,null,"スペース",null,null,null,null,null,null,null,"属性",null,null,"○","○","40",{"$f":"IF($X35=\"\",\"\",VLOOKUP($X35,$AD$7:$AL$128,2,))","v":"メーカ所属組織名"},{"$f":"IF($X35=\"\",\"\",VLOOKUP($X35,$AD$7:$AL$128,5,))","v":"X"},{"$f":"IF($X35=\"\",\"\",VLOOKUP($X35,$AD$7:$AL$128,6,))","v":10},{"$f":"IF($X35=\"\",\"\",VLOOKUP($X35,$AD$7:$AL$128,7,))","v":0},null,"29","伝票合計金額",null,null,9,8,null,"○"]
[null,null,"30","伝票区分",null,null,"9",1,null,"○","伝票発行の区分",null,null,"0:菓子統一伝票\n1:ﾁｪｰﾝｽﾄｱ統一伝票　　     (OCR、タイプ用で伝票№が印刷されていないもの)\n2:専用伝票            　　   (専用伝票(チェーンストア統一伝票手書用を含む)で\n                                         専用伝票No.をレコード中に表示できるもの)\n3:専用伝票だが、レコード中に元伝№を表示できないもの\n4:チェーンストア統一伝票  （ターンアラウンド用）\n8:伝票レス",null,null,null,null,null,null,"ｺｰﾄﾞ(新)","○","○","41",{"$f":"IF($X36=\"\",\"\",VLOOKUP($X36,$AD$7:$AL$128,2,))","v":"伝票区分"},{"$f":"IF($X36=\"\",\"\",VLOOKUP($X36,$AD$7:$AL$128,5,))","v":9},{"$f":"IF($X36=\"\",\"\",VLOOKUP($X36,$AD$7:$AL$128,6,))","v":1},{"$f":"IF($X36=\"\",\"\",VLOOKUP($X36,$AD$7:$AL$128,7,))","v":0},null,"30","二次店納入合計金額符号",null,null,"X",1]
[null,null,"31","定番特売区分",null,null,"X",1,null,"○","定番発注/特売発注の区分",null,null,null,null,null,"0:定番","1:特売","属性",null,null,"○","\"0\"･”1”以外→\"0\"","42",{"$f":"IF($X37=\"\",\"\",VLOOKUP($X37,$AD$7:$AL$128,2,))","v":"定番特売区分"},{"$f":"IF($X37=\"\",\"\",VLOOKUP($X37,$AD$7:$AL$128,5,))","v":"X"},{"$f":"IF($X37=\"\",\"\",VLOOKUP($X37,$AD$7:$AL$128,6,))","v":1},{"$f":"IF($X37=\"\",\"\",VLOOKUP($X37,$AD$7:$AL$128,7,))","v":0},null,"31","二次店納入合計金額",null,null,9,8]
[null,1.1000000000000001,"32","摘要欄０１",null,null,"X",30,null,null,"伝票の摘要欄の内容",null,null,null,null,null,null,null,"属性",null,null,"○","日本語区分(摘要)が\n漢字  ：摘要カナ\nその他：摘要","50\n103","摘要\n摘要カナ","X/N\nX","50\n30",0,null,"32","一次店名",null,null,"X/N",40,null,"○"]
[null,null,"33","メーカコード",null,null,"X",9,null,"○","国コード２桁を含むメーカコード",null,"(７桁の場合左詰め後ろスペース)",null,null,null,null,null,"属性",null,null,"○","○","39",{"$f":"IF($X39=\"\",\"\",VLOOKUP($X39,$AD$7:$AL$128,2,))","v":"メーカコード"},{"$f":"IF($X39=\"\",\"\",VLOOKUP($X39,$AD$7:$AL$128,5,))","v":"X"},{"$f":"IF($X39=\"\",\"\",VLOOKUP($X39,$AD$7:$AL$128,6,))","v":9},{"$f":"IF($X39=\"\",\"\",VLOOKUP($X39,$AD$7:$AL$128,7,))","v":0},null,"33","二次店名",null,null,"X/N",40]
[null,null,"34","予備０２",null,null,"X",14,null,null,"新フォーマット連携エリア間のデータ連携",null,"(卸伝票NO８桁化対応）",null,null,null,null,null,null,null,null,"○","ヘッダー連携エリア上10桁\n+　卸発注伝票NO上2桁","63\n13","ヘッダー連携エリア\n卸発注伝票NO","X\n9","20\n8",0,null,"34","三次店名",null,null,"X/N",40]
[null,null,"（次頁に続く）",null,null,null,null,null,null,null,null,null,null,null,null,null,null,null,null,null,null,null,null,null,null,null,null,null,null,"35","届け先名",null,null,"X/N",40,null,"○"]
[null,null,null,null,null,null,null,null,null,null,null,null,null,null,null,null,null,null,null,null,null,null,null,null,null,null,null,null,null,"36","チェーン店名",null,null,"X/N",40]
[null,null,null,null,null,null,null,null,null,null,null,null,null,null,null,null,null,null,null,null,null,null,null,null,null,null,null,null,null,"37","電話番号",null,null,"X",15]
[null,null,null,null,null,null,null,null,null,null,null,null,null,null,null,null,null,null,null,null,null,null,null,null,null,null,null,null,null,"38","住所",null,null,"X/N",80]
[null,null,"（前頁の続き）",null,null,null,null,null,null,null,null,null,null,null,null,null,null,null,null,null,null,null,null,null,null,null,null,null,null,"39","メーカコード",null,null,"X",9,null,"○"]
[null,"変更","項番","　項目",null,null,"属性","整数桁","小数桁","必須","　項目説明",null,null,null,null,null,"　コード",null,"アップロード","Ｖ１ → Ｖ１","Ｖ１ → Ｖ２","Ｖ１ ← Ｖ１","Ｖ１ ← Ｖ２","　　　　　　　Ｖ２フォーマット",null,null,null,null,null,"40","メーカ所属組織名",null,null,"X",10]
[null,null,null,null,null,null,null,null,null,null,null,null,null,null,null,null,null,null,"チェック","センタチェック","センタチェック","コンバート","コンバート","項番","　　項目","属性","整数","小数",null,"41","伝票区分",null,null,9,1,null,"○"]
[null,null,null,"明細部　　　　　　　　　　　　　　　　　　　　　　　　　　　　　　　　　　　　　　　　",null,null,null,null,null,null,null,null,null,null,null,null,null,null,null,null,null,null,null,null,{"$f":"IF($X48=\"\",\"\",VLOOKUP($X48,$AD$7:$AL$128,2,))","v":""},{"$f":"IF($X48=\"\",\"\",VLOOKUP($X48,$AD$7:$AL$128,5,))","v":""},{"$f":"IF($X48=\"\",\"\",VLOOKUP($X48,$AD$7:$AL$128,6,))","v":""},{"$f":"IF($X48=\"\",\"\",VLOOKUP($X48,$AD$7:$AL$128,7,))","v":""},null,"42","定番特売区分",null,null,"X",1,null,"○"]
[null,null,"35",null,"行NO",null,"9",2,null,"○","明細行NO",null,null,null,null,null,"01～06",null,null,null,"属性(ｽ)","○","○","64",{"$f":"IF($X49=\"\",\"\",VLOOKUP($X49,$AD$7:$AL$128,3,))","v":"明細行NO"},{"$f":"IF($X49=\"\",\"\",VLOOKUP($X49,$AD$7:$AL$128,5,))","v":9},{"$f":"IF($X49=\"\",\"\",VLOOKUP($X49,$AD$7:$AL$128,6,))","v":2},{"$f":"IF($X49=\"\",\"\",VLOOKUP($X49,$AD$7:$AL$128,7,))","v":0},null,"43","ロット不足運賃負担区分",null,null,"X",1]
[null,null,"36",null,"専用伝票行NO",null,"9",2,null,null,"専用伝票の行NO",null,null,null,null,null,null,null,null,null,"属性(ｽ)","○","○","65",{"$f":"IF($X50=\"\",\"\",VLOOKUP($X50,$AD$7:$AL$128,3,))","v":"専用伝票行NO"},{"$f":"IF($X50=\"\",\"\",VLOOKUP($X50,$AD$7:$AL$128,5,))","v":9},{"$f":"IF($X50=\"\",\"\",VLOOKUP($X50,$AD$7:$AL$128,6,))","v":2},{"$f":"IF($X50=\"\",\"\",VLOOKUP($X50,$AD$7:$AL$128,7,))","v":0},null,"44","下請法",null,"伝票表示区分","X",1]
[null,null,"37",null,"商品コード識別区分",null,"X",1,null,"○","品番(商品コード)の識別区分",null,null,null,null,null,"0:統一商品コード\n1:ＩＴＦコード(14桁)\n2:ＩＴＦｺｰﾄﾞ(拡張16桁)\n3:JANコード(標準:13桁)\n4:JANコード(短縮:8桁)\n6:GTINコード(14桁)",null,"属性",null,"必須＋コード(新)\n\n\"2\"は連携不可","○","○","66",{"$f":"IF($X51=\"\",\"\",VLOOKUP($X51,$AD$7:$AL$128,3,))","v":"商品コード識別区分"},{"$f":"IF($X51=\"\",\"\",VLOOKUP($X51,$AD$7:$AL$128,5,))","v":9},{"$f":"IF($X51=\"\",\"\",VLOOKUP($X51,$AD$7:$AL$128,6,))","v":1},{"$f":"IF($X51=\"\",\"\",VLOOKUP($X51,$AD$7:$AL$128,7,))","v":0},null,"45",null,null,"伝票表示内容","X/N",80]
[null,null,"38",null,"品番",null,"X",16,null,"○","統一商品ｺｰﾄﾞ，ITFｺｰﾄﾞ，JANｺｰﾄﾞまたはGTINｺｰﾄﾞ（左詰め）",null,null,null,null,null,null,null,"属性",null,null,"○","○","67",{"$f":"IF($X52=\"\",\"\",VLOOKUP($X52,$AD$7:$AL$128,3,))","v":"品番"},{"$f":"IF($X52=\"\",\"\",VLOOKUP($X52,$AD$7:$AL$128,5,))","v":"X"},{"$f":"IF($X52=\"\",\"\",VLOOKUP($X52,$AD$7:$AL$128,6,))","v":16},{"$f":"IF($X52=\"\",\"\",VLOOKUP($X52,$AD$7:$AL$128,7,))","v":0},null,"46",null,null,"日本語区分（表示）","X",1]
[null,1.1000000000000001,"39",null,"商品名",null,"X",25,null,"○","商品名",null,null,null,null,null,null,null,"属性",null,null,"○","日本語区分(商品名)が\n漢字  ：商品名カナ\nその他：商品名","68\n104","商品名\n商品名カナ","X/N\nX","40\n25",0,null,"47",null,null,"支払期限",9,8]
[null,null,"40",null,"包装区分",null,"9",1,null,"○","数量の発注単位の区分",null,"(1:ケース発注時)","(2:ボール発注時)","(3:バラ発注時)",null,"1:ケース発注\n2:ボール発注","3:バラ発注",null,null,null,"○","○","69",{"$f":"IF($X54=\"\",\"\",VLOOKUP($X54,$AD$7:$AL$128,3,))","v":"包装区分"},{"$f":"IF($X54=\"\",\"\",VLOOKUP($X54,$AD$7:$AL$128,5,))","v":9},{"$f":"IF($X54=\"\",\"\",VLOOKUP($X54,$AD$7:$AL$128,6,))","v":1},{"$f":"IF($X54=\"\",\"\",VLOOKUP($X54,$AD$7:$AL$128,7,))","v":0},null,"48","消費税区分",null,null,"X",1]
[null,null,"41",null,"内容","ボール内バラ数","9",4,2,"○","包装区分に準じた設定",null,"(ボール内バラ数","/ボール内バラ数","/ゼロ)",null,null,null,"属性＋桁数",null,"属性(ｽ)","○","○","70",{"$f":"IF($X55=\"\",\"\",VLOOKUP($X55,$AD$7:$AL$128,4,))","v":"ボール内バラ数"},9,4,2,null,"49","消費税率",null,null,9,2,1]
[null,null,"42",null,null,"ケース内ボール数","9",2,null,"○","包装区分に準じた設定",null,"(ケース内ボール数","/ゼロ","/ゼロ)",null,null,null,"属性＋桁数",null,"属性(ｽ)","○","○","71","ケース内ボール数",9,2,0,null,"50","摘要",null,null,"X/N",50]
[null,null,"43",null,"数量符号",null,"X",1,null,"○","数量の符号",null,null,null,null,null,"＋:正数","－:負数","属性",null,"ｺｰﾄﾞ","\"△\" → \"+\" (有効明細時)","\"△\" → \"+\"","72",{"$f":"IF($X57=\"\",\"\",VLOOKUP($X57,$AD$7:$AL$128,3,))","v":"数量符号"},"X",1,0]
[null,null,"44",null,"数量","ケース数量","9",7,null,"○","包装区分に準じた設定",null,"(ケース数量","/ゼロ","/ゼロ)",null,null,null,"属性＋桁数",null,"属性(ｽ)","○","○","73",{"$f":"IF($X58=\"\",\"\",VLOOKUP($X58,$AD$7:$AL$128,4,))","v":"ケース数量"},9,7,0]
[null,null,"45",null,null,"ボール数量","9",7,null,"○","包装区分に準じた設定",null,"(ゼロ","/ボール数量","/ゼロ)",null,null,null,"属性＋桁数",null,"属性(ｽ)","○","○","74",{"$f":"IF($X59=\"\",\"\",VLOOKUP($X59,$AD$7:$AL$128,4,))","v":"ボール数量"},9,7,0,null,"　"]
[null,null,"46",null,null,"バラ数量","9",7,2,"○","バラ数量",null,null,null,null,null,null,null,"属性＋桁数",null,"属性(ｽ)","○","○","75","バラ数量",9,7,2]
[null,null,"47",null,"単価","卸店入価格","9",6,2,"○","卸店入価格",null,"(バラ単価)",null,null,null,null,null,"属性＋桁数",null,"属性(ｽ)","○","○","76","卸店入価格",9,6,2,null,"　"]
[null,null,"48",null,null,"二次店納入価格","9",6,2,null,"二次卸店等への納入価格",null,"(バラ単価)",null,null,null,null,null,"属性＋桁数",null,"属性(ｽ)","○","○","77","二次店納入価格",9,6,2,null,"項番","　項目",null,null,"属性","整数桁","小数桁","必須"]
[null,null,"49",null,"金額符号",null,"X",1,null,"○","金額の符号",null,null,null,null,null,"＋:正数","－:負数","属性",null,"ｺｰﾄﾞ","\"△\" → \"+\" (有効明細時)","\"△\" → \"+\"","78",{"$f":"IF($X63=\"\",\"\",VLOOKUP($X63,$AD$7:$AL$128,3,))","v":"金額符号"},"X",1,0]
[null,null,"50",null,"金額","卸店入金額","9",8,null,"○","卸店入金額",null,null,null,null,null,null,null,"属性＋桁数","属性(ｻ)","属性(ｽ)","○","○","79",{"$f":"IF($X64=\"\",\"\",VLOOKUP($X64,$AD$7:$AL$128,4,))","v":"卸店入金額"},9,8,0,null,"51","取引先区分（一次店）",null,null,"X",1]
[null,null,"51",null,null,"二次店納入金額","9",8,null,null,"二次卸店等への納入金額",null,null,null,null,null,null,null,"属性＋桁数","属性(ｻ)","属性(ｽ)","○","○","80",{"$f":"IF($X65=\"\",\"\",VLOOKUP($X65,$AD$7:$AL$128,4,))","v":"二次店納入金額"},9,8,0,null,"52","取引先区分（二次店）",null,null,"X",1]
[null,null,"52",null,"卸最新在庫日付",null,"X",5,null,null,"賞味期限または製造年月日",null,"(YMMDD)",null,null,null,null,null,"属性",null,null,"○","下5桁","86",{"$f":"IF($X66=\"\",\"\",VLOOKUP($X66,$AD$7:$AL$128,3,))","v":"卸最新在庫日付"},9,8,0,null,"53","取引先区分（三次店）",null,null,"X",1]
[null,null,"53","予備０４",null,null,"X",3,null,null,"新フォーマット連携エリア間のデータ連携",null,null,null,null,null,null,null,null,null,null,"○","○\n(１レコード目より設定)","94",{"$f":"IF($X67=\"\",\"\",VLOOKUP($X67,$AD$7:$AL$128,3,))","v":"明細連携エリア"},"X",10,0,null,"54","取引先区分（届け先）",null,null,"X",1]
[null,1.8,"54","レコード件数",null,null,"9",6,null,"○","レコードの総件数\n・データ送信側では、自身のフォーマットのレコード件数を設定する。\n・データ受信側では、当項目と実際のレコード件数の整合性チェックには利用しない。※下記【トレーラレコード連携時の留意事項】を参照のこと\n",null,null,null,null,null,null,null,"属性＋桁数","属性","属性(ｽ)","　※ センター集計値","　※ センター集計値","95",{"$f":"IF($X68=\"\",\"\",VLOOKUP($X68,$AD$7:$AL$128,2,))","v":"レコード件数"},9,6,0,null,"55","取引先区分（チェーン店）",null,null,"X",1]
[null,null,"55","伝票枚数",null,null,"9",6,null,null,"伝票枚数",null,null,null,null,null,null,null,"属性＋桁数","属性","属性(ｽ)","　※ センター集計値","　※ センター集計値","96","伝票枚数",9,6,0,null,"56","日本語区分（一次店）",null,null,"X",1]
[null,null,"56","合計金額符号",null,null,"X",1,null,null,"合計金額の符号",null,null,null,null,null,"＋:正数","－:負数","属性",null,"コード","　　   \"△\" → \"+\"\n　※ センター設定　 ","　　   \"△\" → \"+\"\n　※ センター設定　 ","97","合計金額符号","X",1,0,null,"57","日本語区分（二次店）",null,null,"X",1]
[null,null,"57","合計金額",null,null,"9",10,null,null,"卸店入価格で全明細行の金額合計",null,null,null,null,null,null,null,"属性＋桁数","属性(ｻ)","属性(ｽ)","　※ センター集計値","　※ センター集計値","98",{"$f":"IF($X71=\"\",\"\",VLOOKUP($X71,$AD$7:$AL$128,2,))","v":"合計金額"},9,10,0,null,"58","日本語区分（三次店）",null,null,"X",1]
[null,null,"58","予備０５",null,null,"X",214,null,null,"レイアウト拡張時の予備領域",null,"(利用禁止）",null,null,null,null,null,null,null,null,"○","属性初期値",null,{"$f":"IF($X72=\"\",\"\",VLOOKUP($X72,$AD$6:$AK$161,2,))","v":""},{"$f":"IF($X72=\"\",\"\",VLOOKUP($X72,$AD$6:$AK$161,5,))","v":""},{"$f":"IF($X72=\"\",\"\",VLOOKUP($X72,$AD$6:$AK$161,6,))","v":""},{"$f":"IF($X72=\"\",\"\",VLOOKUP($X72,$AD$6:$AK$161,7,))","v":""},null,"59","日本語区分（届け先）",null,null,"X",1]
[null,null,"59","一次店漢字名",null,null,"X",60,null,null,"漢字OP廃止",null,"(利用禁止）",null,null,null,null,null,null,null,null,null,null,null,"","","","",null,"60","日本語区分（チェーン店）",null,null,"X",1]
[null,null,"60","二次店漢字名",null,null,"X",60,null,null,"漢字OP廃止",null,"(利用禁止）",null,null,null,null,null,null,null,null,null,null,null,"","","","",null,"61","日本語区分（住所）",null,null,"X",1]
[null,null,"61","届け先漢字名",null,null,"X",60,null,null,"漢字OP廃止",null,"(利用禁止）",null,null,null,null,null,null,null,null,null,null,null,"","","","",null,"62","日本語区分（摘要）",null,null,"X",1]
[null,null,"62","摘要欄０２",null,null,"X",50,null,null,"漢字OP廃止",null,"(利用禁止）",null,null,null,null,null,null,null,null,null,null,null,"","","","",null,"63","ヘッダー連携エリア",null,null,"X",20]
[null,null,"63","予備０６",null,null,"X",7,null,null,"漢字OP廃止",null,"(利用禁止）",null,null,null,null,null,null,null,null,null,null,null,"","","","",null,null,"明細部　　　　　　　　　　　　　　　　　　　　　　　　　　　　　　　　　　　　　　　　"]
[null,null,"64","改行コード",null,null,"X","2",null,null,"S-JISの改行コードを設定",null,null,null,null,null,null,null,null,null,null,null,null,null,"","","","",null,"64",null,"明細行NO",null,9,2,null,"◎"]
[null,null,null,null,null,null,null,null,null,null,null,null,null,null,null,null,null,null,null,null,null,"　※ 配信分割時",null,null,"","","","",null,"65",null,"専用伝票行NO",null,9,2]
[null,null,null,null,null,null,null,null,null,null,null,null,null,null,null,null,null,null,null,null,null,null,null,null,"","","","",null,"66",null,"商品コード識別区分",null,9,1,null,"○"]
[null,null,null,null,null,null,null,null,null,null," ※ファイルの形式は、カンマ区切りの可変長形式となります。各項目の値にダブルクォート「\"」の囲みは不要です。",null,null,null,null,null,null,null,null,null,null,null,null,null,null,null,null,null,null,"67",null,"品番",null,"X",16,null,"○"]
[null,null,null,null,null,null,null,null,null,null," ※画面から受信（ダウンロード）したファイルの最終行にはエンドレコードが出力されます。",null,null,null,null,null,null,null,null,null,null,null,null,null,null,null,null,null,null,"68",null,"商品名",null,"X/N",40,null,"○"]
[null,null,null,null,null,null,null,null,null,null,"　  エンドレコードのレイアウトは「エンドレコード」を参照してください。",null,null,null,null,null,null,null,null,null,null,null,null,null,null,null,null,null,null,"69",null,"包装区分",null,9,1,null,"○"]
[null,null,null,null,null,null,null,null,null,null," ※画面から送信（アップロード）するファイルにエンドレコードは不要です。",null,null,null,null,null,null,null,null,null,null,null,null,null,null,null,null,null,null,"70",null,"内容","ボール内バラ数",9,4,2,"○"]
[null,null,null,null,null,null,null,null,null,null,null,null,null,null,null,null,null,null,null,null,null,null,null,null,null,null,null,null,null,"71",null,null,"ケース内ボール数",9,2,null,"○"]
[null,null,null,null,null,null,null,null,null,null,null,null,null,null,null,null,null,null,null,null,null,null,null,null,null,null,null,null,null,"72",null,"数量符号",null,"X",1,null,"○"]
[null,null,null,null,null,null,null,null,null,null,null,null,null,null,null,null,null,null,null,null,null,null,null,null,null,null,null,null,null,"73",null,"数量","ケース数量",9,7,null,"○"]
[null,null,null,null,null,null,null,null,null,null,null,null,null,null,null,null,null,null,null,null,null,null,null,null,null,null,null,null,null,"74",null,null,"ボール数量",9,7,null,"○"]
[null,null,null,null,null,null,null,null,null,null,null,null,null,null,null,null,null,null,null,null,null,null,null,null,null,null,null,null,null,"75",null,null,"バラ数量",9,7,2,"○"]
[null,null,null,null,null,null,null,null,null,null,null,null,null,null,null,null,null,null,null,null,null,null,null,null,null,null,null,null,null,"76",null,"単価","卸店入価格",9,6,2,"○"]
[null,null,null,null,null,null,null,null,null,null,null,null,null,null,null,null,null,null,null,null,null,null,null,null,null,null,null,null,null,"77",null,null,"二次店納入価格",9,6,2]
[null,null,null,null,null,null,null,null,null,null,null,null,null,null,null,null,null,null,null,null,null,null,null,null,null,null,null,null,null,"78",null,"金額符号",null,"X",1,null,"○"]
[null,null,null,null,null,null,null,null,null,null,null,null,null,null,null,null,null,null,null,null,null,null,null,null,null,null,null,null,null,"79",null,"金額","卸店入金額",9,8,null,"○"]
[null,null,null,null,null,null,null,null,null,null,null,null,null,null,null,null,null,null,null,null,null,null,null,null,null,null,null,null,null,"80",null,null,"二次店納入金額",9,8]
[null,null,null,null,null,null,null,null,null,null,null,null,null,null,null,null,null,null,null,null,null,null,null,null,null,null,null,null,null,"81",null,"商品添付区分",null,"X",1]
[null,null,null,null,null,null,null,null,null,null,null,null,null,null,null,null,null,null,null,null,null,null,null,null,null,null,null,null,null,"82",null,"入荷単位ケース数",null,9,2]
[null,null,null,null,null,null,null,null,null,null,null,null,null,null,null,null,null,null,null,null,null,null,null,null,null,null,null,null,null,"83",null,"卸発注行番号",null,9,2]
[null,null,null,null,null,null,null,null,null,null,null,null,null,null,null,null,null,null,null,null,null,null,null,null,null,null,null,null,null,"84",null,"納入単価表示区分",null,"X",1]
[null,null,null,null,null,null,null,null,null,null,null,null,null,null,null,null,null,null,null,null,null,null,null,null,null,null,null,null,null,"85",null,"卸最新在庫日付区分",null,"X",1]
[null,null,null,null,null,null,null,null,null,null,null,null,null,null,null,null,null,null,null,null,null,null,null,null,null,null,null,null,null,"86",null,"卸最新在庫日付",null,9,8]
[null,null,null,null,null,null,null,null,null,null,null,null,null,null,null,null,null,null,null,null,null,null,null,null,null,null,null,null,null,"87",null,"入庫許容日付区分",null,"X",1]
[null,null,null,null,null,null,null,null,null,null,null,null,null,null,null,null,null,null,null,null,null,null,null,null,null,null,null,null,null,"88",null,"入庫許容日付",null,9,8]
[null,null,null,null,null,null,null,null,null,null,null,null,null,null,null,null,null,null,null,null,null,null,null,null,null,null,null,null,null,"89",null,"温度管理区分",null,"X",1]
[null,null,null,null,null,null,null,null,null,null,null,null,null,null,null,null,null,null,null,null,null,null,null,null,null,null,null,null,null,"90",null,"摘要",null,"X/N",50]
[null,null,null,null,null,null,null,null,null,null,null,null,null,null,null,null,null,null,null,null,null,null,null,null,null,null,null,null,null,"91",null,"日本語区分（商品名）",null,"X",1]
[null,null,null,null,null,null,null,null,null,null,null,null,null,null,null,null,null,null,null,null,null,null,null,null,null,null,null,null,null,"92",null,"日本語区分（摘要）",null,"X",1]
[null,null,null,null,null,null,null,null,null,null,null,null,null,null,null,null,null,null,null,null,null,null,null,null,null,null,null,null,null,"93",null,"菓子業界商品分類コード",null,"X",6]
[null,null,null,null,null,null,null,null,null,null,null,null,null,null,null,null,null,null,null,null,null,null,null,null,null,null,null,null,null,"94",null,"明細連携エリア",null,"X",10]
[]
[]
[null,null,null,null,null,null,null,null,null,null,null,null,null,null,null,null,null,null,null,null,null,null,null,null,null,null,null,null,null,"　"]
[]
[null,null,null,null,null,null,null,null,null,null,null,null,null,null,null,null,null,null,null,null,null,null,null,null,null,null,null,null,null,"　"]
[null,null,null,null,null,null,null,null,null,null,null,null,null,null,null,null,null,null,null,null,null,null,null,null,null,null,null,null,null,"項番","　項目",null,null,"属性","整数桁","小数桁","必須"]
[]
[null,null,null,null,null,null,null,null,null,null,null,null,null,null,null,null,null,null,null,null,null,null,null,null,null,null,null,null,null,"95","レコード件数",null,null,9,6,null,"○"]
[null,null,null,null,null,null,null,null,null,null,null,null,null,null,null,null,null,null,null,null,null,null,null,null,null,null,null,null,null,"96","伝票枚数",null,null,9,6]
[null,null,null,null,null,null,null,null,null,null,null,null,null,null,null,null,null,null,null,null,null,null,null,null,null,null,null,null,null,"97","合計金額符号",null,null,"X",1]
[null,null,null,null,null,null,null,null,null,null,null,null,null,null,null,null,null,null,null,null,null,null,null,null,null,null,null,null,null,"98","合計金額",null,null,9,10]
[null,null,null,null,null,null,null,null,null,null,null,null,null,null,null,null,null,null,null,null,null,null,null,null,null,null,null,null,null,"99","連携エリア",null,null,"X",20]
[null,null,null,null,null,null,null,null,null,null,null,null,null,null,null,null,null,null,null,null,null,null,null,null,null,null,null,null,null,"100","一次店カナ名",null,null,"X",30]
[null,null,null,null,null,null,null,null,null,null,null,null,null,null,null,null,null,null,null,null,null,null,null,null,null,null,null,null,null,"101","二次店カナ名",null,null,"X",30]
[null,null,null,null,null,null,null,null,null,null,null,null,null,null,null,null,null,null,null,null,null,null,null,null,null,null,null,null,null,"102","届け先カナ名",null,null,"X",30]
[null,null,null,null,null,null,null,null,null,null,null,null,null,null,null,null,null,null,null,null,null,null,null,null,null,null,null,null,null,"103","摘要カナ",null,null,"X",30]
[null,null,null,null,null,null,null,null,null,null,null,null,null,null,null,null,null,null,null,null,null,null,null,null,null,null,null,null,null,"104","商品名カナ",null,null,"X",25]
[null,null,null,null,null,null,null,null,null,null,null,null,null,null,null,null,null,null,null,null,null,null,null,null,null,null,null,null,null,"105","改行コード",null,null,"X","2"]

{"sheet":"１１入庫予定","index":4,"n_rows":159,"n_cols":37,"rows_kept":159,"cut":false,"hidden":false,"merged":[[37,2,38,2],[37,3,38,4],[37,6,38,6],[37,7,38,7],[109,36,110,36],[37,8,38,8],[37,9,38,9],[37,10,38,10],[37,16,38,16],[109,29,110,29],[109,30,110,31],[109,33,110,33],[109,34,110,34],[109,35,110,35],[61,30,62,31],[61,33,62,33],[61,34,62,34],[61,35,62,35],[61,36,62,36],[3,30,4,31],[3,33,4,33],[3,34,4,34],[3,35,4,35],[3,36,4,36],[41,16,41,17],[3,16,4,16],[3,8,4,8],[3,1,4,1],[61,29,62,29],[60,10,60,15],[3,9,4,9],[3,2,4,2],[3,3,4,4],[3,6,4,6],[3,7,4,7],[3,29,4,29],[37,23,37,27],[3,23,3,27],[3,10,4,10],[37,1,38,1]]}
[null,null,null,null,null,null,null,null,null,null,null,null,null,null,null,null,null,null,null,null,null,null,null,null,null,null,null,null,null,{"$f":"シート別総ページ数","v":{"$error":"#NAME?"}}]
[null,null,"（２） Ｖ１・１１入庫予定",null,null,null,null,null,null,null,null,null,null,null,null,null,null,null,null,null,null,null,null,null,null,null,null,null,null,"（２） Ｖ２・１３入庫予定"]
[null,null,null,null,null,null,null,null,null,null,null,null,null,null,null,null,null,null,null,null,null,null,null,null,null,null,null,null,null,"　"]
[null,"変更","項番","　項目",null,null,"属性","整数桁","小数桁","必須","　項目説明",null,null,null,null,null,"　コード",null,"アップロード","Ｖ１ → Ｖ１","Ｖ１ → Ｖ２","Ｖ１ ← Ｖ１","Ｖ１ ← Ｖ２","　　　　　　　Ｖ２フォーマット",null,null,null,null,null,"項番","　項目",null,null,"属性","整数桁","小数桁","必須"]
[null,null,null,null,null,null,null,null,null,null,null,null,null,null,null,null,null,null,"チェック","センタチェック","センタチェック","コンバート","コンバート","項番","　　項目","属性","整数","小数"]
[null,null,"1","データ種別",null,null,"9",2,null,"◎","１１：入庫予定データ",null,null,null,null,null,"11",null,"必須","ｺｰﾄﾞ","ｺｰﾄﾞ","○","\"11\"固定",null,{"$f":"IF($X6=\"\",\"\",VLOOKUP($X6,$AD$6:$AK$161,2,))","v":""},{"$f":"IF($X6=\"\",\"\",VLOOKUP($X6,$AD$6:$AK$161,5,))","v":""},{"$f":"IF($X6=\"\",\"\",VLOOKUP($X6,$AD$6:$AK$161,6,))","v":""},null,null,"1","データ種別",null,null,9,2,null,"◎"]
[null,null,"2","最終トレーラ判定区分",null,null,"X",1,null,"◎","トレーラ判定の区分",null,null,null,null,null,"9:最終","△:それ以外",null,null,null,null,"○","2",{"$f":"IF($X7=\"\",\"\",VLOOKUP($X7,$AD$6:$AK$161,2,))","v":"最終トレーラ判定区分"},{"$f":"IF($X7=\"\",\"\",VLOOKUP($X7,$AD$6:$AK$161,5,))","v":"X"},1,null,null,"2","最終トレーラ判定区分",null,null,"X",1,null,"◎"]
[null,null,"3","送信先コード",null,null,"9",8,null,"◎","送信先(卸)","の統一取引先コード",null,null,null,null,null,null,"必須＋属性＋桁数＋登録","センター登録","センター登録",null,"○","3","送信先コード",9,8,{"$f":"IF($X8=\"\",\"\",VLOOKUP($X8,$AD$6:$AK$161,7,))","v":0},null,"3","送信先コード",null,null,9,8,null,"◎"]
[null,null,"4","送信元コード",null,null,"9",8,null,"◎","送信元(メーカ)","の統一取引先コード",null,null,null,null,null,null,"必須＋属性＋桁数＋登録","センター登録","センター登録",null,"○","4","送信元コード",9,8,0,null,"4","送信元コード",null,null,9,8,null,"◎"]
[null,null,"5","データ作成日",null,null,"9",8,null,"○","本データを作成した日付",null,"(西暦 YYYYMMDD)",null,null,null,null,null,null,null,"必須＋日付","○","○","5","データ作成日",9,8,0,null,"5","データ作成日",null,null,9,8,null,"◎"]
[null,null,"6","送信先名",null,null,"X",20,null,"○","送信元(卸)","のカナ名称",null,null,null,null,null,null,"属性",null,null,"○","○","7","送信先名","X",20,0,null,"6","データ作成時刻",null,null,9,6]
[null,null,"7","送信元名",null,null,"X",20,null,"○","送信先(メーカ)","のカナ名称",null,null,null,null,null,null,"属性",null,"必須","○","○","8","送信元名","X",20,0,null,"7","送信先名",null,null,"X",20,null,"○"]
[null,null,"8","直接送信先コード",null,null,"9",8,null,null,"送信先と異なる場所へ送信する場合にセット。　セット不要の場合\"00000000\"",null,null,null,null,null,null,null,null,"センター登録","センター登録","○","○","9","直接送信先コード",9,8,0,null,"8","送信元名",null,null,"X",20,null,"◎"]
[null,null,"9","直接送信先カナ名",null,null,"X",20,null,null,"送信先と異なる場所へ送信する場合にセット。　セット不要の場合スペース",null,null,null,null,null,null,null,"属性",null,null,"○","○","10","直接送信先名","X",20,0,null,"9","直接送信先コード",null,null,9,8]
[null,null,"10","予備０１",null,null,"X",161,null,null,"レイアウト拡張時の予備領域",null,"(利用禁止）",null,null,null,null,null,null,null,null,"○","属性初期値",null,"","","","",null,"10","直接送信先名",null,null,"X",20]
[null,null,"11","卸伝票NO",null,null,"9",6,null,"◎","発注NO",null,null,null,null,null,null,null,"必須＋属性＋桁数",null,"属性(ｽ)","○","下６桁","13","卸発注伝票NO",9,8,0,null,"11","送信ファイルNO",null,null,9,2]
[null,null,"12","メーカ伝票NO",null,null,"9",6,null,null,"メーカ伝票NO",null,null,null,null,null,null,null,null,null,"属性(ｽ)","○","下６桁","14","メーカ伝票NO",9,8,0,null,"12","連携エリア",null,null,"X",20]
[null,null,"13","元伝NO",null,null,"9",6,null,null,"元伝NO",null,null,null,null,null,null,null,null,null,null,"○","下６桁","37","元伝NO",9,8,0,null,"13","卸発注伝票NO",null,null,9,8,null,"○"]
[null,2.7,"14","取引コード",null,null,"9",2,null,"○","業界統一取引コード",null,null,null,null,null,"11:店入売上\n12:店入売上訂正\n21:店入返品\n22:店入返品訂正\n31:直送売上\n32:直送売上訂正\n\n\n\n","41:直送返品\n42:直送返品訂正\n51:割戻し金\n52:相殺\n81:ﾒｰｶｰ提供の役務\n91:卸提供の役務",null,null,"必須＋ｺｰﾄﾞ","○","○","16","取引コード",9,2,0,null,"14","メーカ伝票NO",null,null,9,8]
[null,null,"15","納品日",null,null,"9",8,null,"○","発注伝票の納品日 ",null,"(西暦 YYYYMMDD)",null,null,null,null,null,"属性＋桁数",null,"日付","○","○","17","納品日",9,8,0,null,"15","店入直送区分",null,null,9,1,null,"◎"]
[null,null,"16","出荷日",null,null,"9",8,null,"○","出荷日",null,"(西暦 YYYYMMDD)",null,null,null,null,null,null,null,"日付","○","○","18","出荷日",9,8,0,null,"16","取引コード",null,null,9,2,null,"◎"]
[null,null,"17","着荷日",null,null,"9",8,null,"○","納品予定日 ",null,"(西暦 YYYYMMDD)",null,null,null,null,null,null,null,"日付","○","○","19","着荷日",9,8,0,null,"17","納品日",null,null,9,8,null,"○"]
[null,null,"18","納入時間",null,null,"9",4,null,null,"納入予定時間",null,"(HHMM)",null,null,null,null,null,null,null,"時刻","○","○","20","納入予定時間",9,4,0,null,"18","出荷日",null,null,9,8,null,"○"]
[null,null,"19","明細行数",null,null,"9",2,null,"○","伝票内明細数",null,null,null,null,null,null,null,null,null,"属性(ｽ)","○","○","28","明細行数",9,2,0,null,"19","着荷日",null,null,9,8,null,"○"]
[null,"2.2\n1.3","20","届け先コード",null,null,"9",8,null,"○","該当する統一取引先コード",null,null,null,null,null,null,null,"属性＋桁数",null,null,"○","GLN時:下８桁\nGLN以外8桁以上:上８桁\nGLN以外8桁未満:前ｾﾞﾛ+　　　　　\n　　　　　　　　　　　　有効桁","32","届け先コード","X",13,0,null,"20","納入予定時間",null,null,9,4]
[null,1.1000000000000001,"21","届け先カナ名",null,null,"X",30,null,"○","届け先名",null,null,null,null,null,null,null,"属性",null,null,"○","日本語区分(届け先)が\n漢字  ：届け先カナ\nその他：届け先名","45\n136","届け先名\n届け先カナ名","X/N\nX","40\n30",0,null,"21","倉庫コード",null,null,"X",4]
[null,null,"22","伝票合計金額符号",null,null,"X",1,null,"○","伝票の合計金額の符号",null,null,null,null,null,"＋:正数","－:負数","属性",null,"ｺｰﾄﾞ","○","\"△\" → \"+\"","38",{"$f":"IF($X27=\"\",\"\",VLOOKUP($X27,$AD$6:$AK$161,2,))","v":"伝票合計金額符号"},{"$f":"IF($X27=\"\",\"\",VLOOKUP($X27,$AD$6:$AK$161,5,))","v":"X"},{"$f":"IF($X27=\"\",\"\",VLOOKUP($X27,$AD$6:$AK$161,6,))","v":1},{"$f":"IF($X27=\"\",\"\",VLOOKUP($X27,$AD$6:$AK$161,7,))","v":0},null,"22","伝送区分",null,null,"X",1]
[null,null,"23","伝票合計金額",null,null,"9",8,null,"○","伝票の合計金額",null,"(卸店入価格)",null,null,null,null,null,"属性＋桁数","属性(ｻ)","属性(ｽ)","○","○","39",{"$f":"IF($X28=\"\",\"\",VLOOKUP($X28,$AD$6:$AK$161,2,))","v":"伝票合計金額"},{"$f":"IF($X28=\"\",\"\",VLOOKUP($X28,$AD$6:$AK$161,5,))","v":9},{"$f":"IF($X28=\"\",\"\",VLOOKUP($X28,$AD$6:$AK$161,6,))","v":8},{"$f":"IF($X28=\"\",\"\",VLOOKUP($X28,$AD$6:$AK$161,7,))","v":0},null,"23","出荷報告以外区分",null,null,"X",1]
[null,null,"24","定番特売区分",null,null,"X",1,null,"○","定番発注/特売発注の区分",null,null,null,null,null,"0:定番","1:特売","属性",null,null,"○","\"0\"･”1”以外→\"0\"","54",{"$f":"IF($X29=\"\",\"\",VLOOKUP($X29,$AD$6:$AK$161,2,))","v":"定番特売区分"},{"$f":"IF($X29=\"\",\"\",VLOOKUP($X29,$AD$6:$AK$161,5,))","v":"X"},{"$f":"IF($X29=\"\",\"\",VLOOKUP($X29,$AD$6:$AK$161,6,))","v":1},{"$f":"IF($X29=\"\",\"\",VLOOKUP($X29,$AD$6:$AK$161,7,))","v":0},null,"24","集計明細区分",null,null,"X",1]
[null,1.1000000000000001,"25","摘要欄０１",null,null,"X",30,null,null,"伝票の摘要欄の内容",null,null,null,null,null,null,null,"属性",null,null,"○","日本語区分(摘要)が\n漢字  ：摘要カナ\nその他：摘要","49\n137","摘要\n摘要カナ","X/N\nX","50\n30",0,null,"25","請求締日",null,null,9,8]
[null,null,"26","メーカコード",null,null,"X",9,null,"○","国コード２桁を含むメーカコード",null,"(７桁の場合左詰め後ろスペース)",null,null,null,null,null,"属性",null,null,"○","○","50",{"$f":"IF($X31=\"\",\"\",VLOOKUP($X31,$AD$6:$AK$161,2,))","v":"メーカコード"},{"$f":"IF($X31=\"\",\"\",VLOOKUP($X31,$AD$6:$AK$161,5,))","v":"X"},{"$f":"IF($X31=\"\",\"\",VLOOKUP($X31,$AD$6:$AK$161,6,))","v":9},{"$f":"IF($X31=\"\",\"\",VLOOKUP($X31,$AD$6:$AK$161,7,))","v":0},null,"26","請求口座",null,null,"X",10]
[null,null,"27","予備０２",null,null,"X",100,null,null,"レイアウト拡張時の予備領域",null,"(卸発注伝票NO８桁化対応）",null,null,null,null,null,null,null,null,"○","卸発注伝票NO上２桁","13",{"$f":"IF($X32=\"\",\"\",VLOOKUP($X32,$AD$6:$AK$161,2,))","v":"卸発注伝票NO"},{"$f":"IF($X32=\"\",\"\",VLOOKUP($X32,$AD$6:$AK$161,5,))","v":9},{"$f":"IF($X32=\"\",\"\",VLOOKUP($X32,$AD$6:$AK$161,6,))","v":8},{"$f":"IF($X32=\"\",\"\",VLOOKUP($X32,$AD$6:$AK$161,7,))","v":0},null,"27","請求支払区分",null,null,9,2]
[null,null,"（次頁に続く）",null,null,null,null,null,null,null,null,null,null,null,null,null,null,null,null,null,null,null,null,null,null,null,null,null,null,"28","明細行数",null,null,9,2,null,"○"]
[null,null,null,null,null,null,null,null,null,null,null,null,null,null,null,null,null,null,null,null,null,null,null,null,null,null,null,null,null,"29","一次店コード",null,null,"X",13,null,"◎"]
[null,null,null,null,null,null,null,null,null,null,null,null,null,null,null,null,null,null,null,null,null,null,null,null,null,null,null,null,null,"30","二次店コード",null,null,"X",13]
[null,null,null,null,null,null,null,null,null,null,null,null,null,null,null,null,null,null,null,null,null,null,null,null,null,null,null,null,null,"31","三次店コード",null,null,"X",13]
[null,null,"（前頁の続き）",null,null,null,null,null,null,null,null,null,null,null,null,null,null,null,null,null,null,null,null,null,null,null,null,null,null,"32","届け先コード",null,null,"X",13,null,"○"]
[null,"変更","項番","　項目",null,null,"属性","整数桁","小数桁","必須","　項目説明",null,null,null,null,null,"　コード",null,"アップロード","Ｖ１ → Ｖ１","Ｖ１ → Ｖ２","Ｖ１ ← Ｖ１","Ｖ１ ← Ｖ２","　　　　　　　Ｖ２フォーマット",null,null,null,null,null,"33","チェーン店コード",null,null,"X",13]
[null,null,null,null,null,null,null,null,null,null,null,null,null,null,null,null,null,null,"チェック","センタチェック","センタチェック","コンバート","コンバート","項番","　　項目","属性","整数","小数",null,"34","専用伝票日付",null,null,9,8]
[null,null,null,"明細部　　　　　　　　　　　　　　　　　　　　　　　　　　　　　　　　　　　　　　　　",null,null,null,null,null,null,null,null,null,null,null,null,null,null,null,null,null,null,null,null,{"$f":"IF($X40=\"\",\"\",VLOOKUP($X40,$AD$6:$AK$161,2,))","v":""},{"$f":"IF($X40=\"\",\"\",VLOOKUP($X40,$AD$6:$AK$161,5,))","v":""},{"$f":"IF($X40=\"\",\"\",VLOOKUP($X40,$AD$6:$AK$161,6,))","v":""},{"$f":"IF($X40=\"\",\"\",VLOOKUP($X40,$AD$6:$AK$161,7,))","v":""},null,"35","専用伝票NO",null,null,9,9]
[null,null,"28",null,"行NO",null,"9",2,null,"○","明細行NO",null,null,null,null,null,"01～06",null,null,null,null,"○","○","71",{"$f":"IF($X41=\"\",\"\",VLOOKUP($X41,$AD$6:$AK$161,3,))","v":"明細行NO"},{"$f":"IF($X41=\"\",\"\",VLOOKUP($X41,$AD$6:$AK$161,5,))","v":9},{"$f":"IF($X41=\"\",\"\",VLOOKUP($X41,$AD$6:$AK$161,6,))","v":2},{"$f":"IF($X41=\"\",\"\",VLOOKUP($X41,$AD$6:$AK$161,7,))","v":0},null,"36","元伝年月日",null,null,9,8]
[null,null,"29",null,"商品コード識別区分",null,"X",1,null,"○","品番(商品コード)の識別区分",null,null,null,null,null,"0:統一商品コード\n1:ＩＴＦコード(14桁)\n2:ＩＴＦｺｰﾄﾞ(拡張16桁)\n3:JANコード(標準:13桁)\n4:JANコード(短縮:8桁)\n6:GTINコード(14桁)",null,"属性",null,"必須＋コード(新)\n\n\"2\"は連携不可","○","○","73",{"$f":"IF($X42=\"\",\"\",VLOOKUP($X42,$AD$6:$AK$161,3,))","v":"商品コード識別区分"},{"$f":"IF($X42=\"\",\"\",VLOOKUP($X42,$AD$6:$AK$161,5,))","v":9},{"$f":"IF($X42=\"\",\"\",VLOOKUP($X42,$AD$6:$AK$161,6,))","v":1},{"$f":"IF($X42=\"\",\"\",VLOOKUP($X42,$AD$6:$AK$161,7,))","v":0},null,"37","元伝NO",null,null,9,8]
[null,null,"30",null,"品番",null,"X",16,null,"○","統一商品ｺｰﾄﾞ，ITFｺｰﾄﾞ，JANｺｰﾄﾞまたはGTINｺｰﾄﾞ（左詰め）",null,null,null,null,null,null,null,"属性",null,null,"○","○","74",{"$f":"IF($X43=\"\",\"\",VLOOKUP($X43,$AD$6:$AK$161,3,))","v":"品番"},{"$f":"IF($X43=\"\",\"\",VLOOKUP($X43,$AD$6:$AK$161,5,))","v":"X"},{"$f":"IF($X43=\"\",\"\",VLOOKUP($X43,$AD$6:$AK$161,6,))","v":16},{"$f":"IF($X43=\"\",\"\",VLOOKUP($X43,$AD$6:$AK$161,7,))","v":0},null,"38","伝票合計金額符号",null,null,"X",1,null,"○"]
[null,1.1000000000000001,"31",null,"商品名",null,"X",25,null,"○","商品名",null,null,null,null,null,null,null,"属性",null,null,"○","日本語区分(商品名)が\n漢字  ：商品名カナ\nその他：商品名","75\n138","商品名\n商品名カナ","X/N\nX","40\n25",0,null,"39","伝票合計金額",null,null,9,8,null,"○"]
[null,null,"32",null,"包装区分",null,"9",1,null,"○","数量の発注単位の区分",null,"(1:ケース発注時)","(2:ボール発注時)","(3:バラ発注時)",null,"1:ケース発注\n2:ボール発注","3:バラ発注",null,null,null,"○","○","76",{"$f":"IF($X45=\"\",\"\",VLOOKUP($X45,$AD$6:$AK$161,3,))","v":"包装区分"},{"$f":"IF($X45=\"\",\"\",VLOOKUP($X45,$AD$6:$AK$161,5,))","v":9},{"$f":"IF($X45=\"\",\"\",VLOOKUP($X45,$AD$6:$AK$161,6,))","v":1},{"$f":"IF($X45=\"\",\"\",VLOOKUP($X45,$AD$6:$AK$161,7,))","v":0},null,"40","二次店納入合計金額符号",null,null,"X",1]
[null,null,"33",null,"内容","ボール内バラ数","9",4,2,"○","包装区分に準じた設定",null,"(ボール内バラ数","/ボール内バラ数","/ゼロ)",null,null,null,"属性＋桁数",null,"属性(ｽ)","○","○","77",{"$f":"IF($X46=\"\",\"\",VLOOKUP($X46,$AD$6:$AK$161,4,))","v":"ボール内バラ数"},9,4,2,null,"41","二次店納入合計金額",null,null,9,8]
[null,null,"34",null,null,"ケース内ボール数","9",2,null,"○","包装区分に準じた設定",null,"(ケース内ボール数","/ゼロ","/ゼロ)",null,null,null,"属性＋桁数",null,"属性(ｽ)","○","○","78",{"$f":"IF($X47=\"\",\"\",VLOOKUP($X47,$AD$6:$AK$161,4,))","v":"ケース内ボール数"},9,2,0,null,"42","一次店名",null,null,"X/N",40]
[null,null,"35",null,"数量符号",null,"X",1,null,"○","数量の符号",null,null,null,null,null,"＋:正数","－:負数","属性",null,"ｺｰﾄﾞ","○","\"△\" → \"+\"","79",{"$f":"IF($X48=\"\",\"\",VLOOKUP($X48,$AD$6:$AK$161,3,))","v":"数量符号"},"X",1,0,null,"43","二次店名",null,null,"X/N",40]
[null,null,"36",null,"数量","ケース数量","9",7,null,"○","包装区分に準じた設定",null,"(ケース数量","/ゼロ","/ゼロ)",null,null,null,"属性＋桁数",null,"属性(ｽ)","○","○","80",{"$f":"IF($X49=\"\",\"\",VLOOKUP($X49,$AD$6:$AK$161,4,))","v":"ケース数量"},9,7,0,null,"44","三次店名",null,null,"X/N",40]
[null,null,"37",null,null,"ボール数量","9",7,null,"○","包装区分に準じた設定",null,"(ゼロ","/ボール数量","/ゼロ)",null,null,null,"属性＋桁数",null,"属性(ｽ)","○","○","81",{"$f":"IF($X50=\"\",\"\",VLOOKUP($X50,$AD$6:$AK$161,4,))","v":"ボール数量"},9,7,0,null,"45","届け先名",null,null,"X/N",40,null,"○"]
[null,null,"38",null,null,"バラ数量","9",7,2,"○","バラ数量",null,null,null,null,null,null,null,"属性＋桁数",null,"属性(ｽ)","○","○","82",{"$f":"IF($X51=\"\",\"\",VLOOKUP($X51,$AD$6:$AK$161,4,))","v":"バラ数量"},9,7,2,null,"46","チェーン店名",null,null,"X/N",40]
[null,null,"39",null,"単価","卸店入価格","9",6,2,"○","卸店入価格",null,"(バラ単価)",null,null,null,null,null,"属性＋桁数",null,"属性(ｽ)","○","○","83",{"$f":"IF($X52=\"\",\"\",VLOOKUP($X52,$AD$6:$AK$161,4,))","v":"卸店入価格"},9,6,2,null,"47","電話番号",null,null,"X",15]
[null,null,"40",null,null,"二次店納入価格","9",6,2,null,"二次卸店等への納入価格",null,"(バラ単価)",null,null,null,null,null,"属性＋桁数",null,"属性(ｽ)","○","○","84",{"$f":"IF($X53=\"\",\"\",VLOOKUP($X53,$AD$6:$AK$161,4,))","v":"二次店納入価格"},9,6,2,null,"48","住所",null,null,"X/N",80]
[null,null,"41",null,"金額符号",null,"X",1,null,"○","金額の符号",null,null,null,null,null,"＋:正数","－:負数","属性",null,"ｺｰﾄﾞ","○","\"△\" → \"+\"","85",{"$f":"IF($X54=\"\",\"\",VLOOKUP($X54,$AD$6:$AK$161,3,))","v":"金額符号"},"X",1,0,null,"49","摘要",null,null,"X/N",50]
[null,null,"42",null,"金額","卸店入金額","9",8,null,"○","卸店入金額",null,null,null,null,null,null,null,"属性＋桁数","属性(ｻ)","属性(ｽ)","○","○","86",{"$f":"IF($X55=\"\",\"\",VLOOKUP($X55,$AD$6:$AK$161,4,))","v":"卸店入金額"},9,8,0,null,"50","メーカコード",null,null,"X",9,null,"○"]
[null,null,"43",null,null,"二次店納入金額","9",8,null,null,"二次卸店等への納入金額",null,null,null,null,null,null,null,"属性＋桁数","属性(ｻ)","属性(ｽ)","○","○","87",{"$f":"IF($X56=\"\",\"\",VLOOKUP($X56,$AD$6:$AK$161,4,))","v":"二次店納入金額"},9,8,0,null,"51","メーカ所属組織名",null,null,"X",10]
[null,null,"44",null,"欠品区分",null,"9",1,null,"○","商品欠品区分",null,null,null,null,null,"0:正常\n1:品切れ\n2:終売","3:未発売 \n4:商品ｺｰﾄﾞ訂正\n",null,null,"ｺｰﾄﾞ(旧)","○","○","89",{"$f":"IF($X57=\"\",\"\",VLOOKUP($X57,$AD$6:$AK$161,3,))","v":"欠品区分"},9,2,0]
[null,null,"45",null,"商品添付区分",null,"X",1,null,"○","添付商品扱いの区分",null,"(相対運用)",null,null,null,"△:売上 \n1:現物添付","2:見本 \n3:景品","属性",null,"ｺｰﾄﾞ(旧)","○","○","88",{"$f":"IF($X58=\"\",\"\",VLOOKUP($X58,$AD$6:$AK$161,3,))","v":"商品添付区分"},"X",1,0]
[null,1.9,"46",null,"賞味期限製造年月日",null,"X",6,null,null,"賞味期限または製造年月日",null,"(YYMMDD)",null,null,null,null,null,"属性",null,"日付","○","実入庫製品日付下６桁","98",{"$f":"IF($X59=\"\",\"\",VLOOKUP($X59,$AD$6:$AK$161,3,))","v":"実入庫製品日付"},9,8,0,null,"　"]
[null,null,"47","予備０３",null,null,"X",1,null,null,"レイアウト拡張時の予備領域",null,"(利用禁止）",null,null,null,null,null,null,null,null,"○","属性初期値",null,{"$f":"IF($X60=\"\",\"\",VLOOKUP($X60,$AD$6:$AK$161,2,))","v":""},"","",""]
[null,1.8,"48","レコード件数",null,null,"9",6,null,"○","レコードの総件数\n・データ送信側では、自身のフォーマットのレコード件数を設定する。\n・データ受信側では、当項目と実際のレコード件数の整合性チェックには利用しない。※下記【トレーラレコード連携時の留意事項】を参照のこと\n",null,null,null,null,null,null,null,"属性＋桁数","属性","属性(ｽ)","　※ センター集計値","　※ センター集計値","129","レコード件数",9,6,0,null,"　"]
[null,null,"49","伝票枚数",null,null,"9",6,null,null,"伝票枚数",null,null,null,null,null,null,null,"属性＋桁数","属性","属性(ｽ)","　※ センター集計値","　※ センター集計値","130","伝票枚数",9,6,0,null,"項番","　項目",null,null,"属性","整数桁","小数桁","必須"]
[null,null,"50","合計金額符号",null,null,"X",1,null,null,"合計金額の符号",null,null,null,null,null,"＋:正数","－:負数","属性",null,"ｺｰﾄﾞ","　※ センター設定　 ","　　   \"△\" → \"+\"\n　※ センター設定　 ","131","合計金額符号","X",1,0]
[null,null,"51","合計金額",null,null,"9",10,null,null,"卸店入価格で全明細行の金額合計",null,null,null,null,null,null,null,"属性＋桁数","属性(ｻ)","属性(ｽ)","　※ センター集計値","　※ センター集計値","132","合計金額",9,10,0,null,"52","伝票区分",null,null,9,1]
[null,null,"52","予備",null,null,"X",214,null,null,"レイアウト拡張時の予備領域",null,"(利用禁止）",null,null,null,null,null,null,null,null,"○","属性初期値",null,"","","","",null,"53","登録店区分",null,null,"X",1]
[null,null,"53","一次店漢字名",null,null,"X",60,null,null,"漢字OP廃止",null,"(利用禁止）",null,null,null,null,null,null,null,null,null,null,null,"","","","",null,"54","定番特売区分",null,null,"X",1,null,"○"]
[null,null,"54","二次店漢字名",null,null,"X",60,null,null,"漢字OP廃止",null,"(利用禁止）",null,null,null,null,null,null,null,null,null,null,null,"","","","",null,"55","消費税区分",null,null,"X",1]
[null,null,"55","届け先漢字名",null,null,"X",60,null,null,"漢字OP廃止",null,"(利用禁止）",null,null,null,null,null,null,null,null,null,null,null,"","","","",null,"56","消費税率",null,null,9,2,1]
[null,null,"56","摘要欄０２",null,null,"X",50,null,null,"漢字OP廃止",null,"(利用禁止）",null,null,null,null,null,null,null,null,null,null,null,"","","","",null,"57","ロット不足運賃負担区分",null,null,"X",1]
[null,null,"57","予備０５",null,null,"X",7,null,null,"漢字OP廃止",null,"(利用禁止）",null,null,null,null,null,null,null,null,null,null,null,"","","","",null,"58","取引先区分（一次店）",null,null,"X",1]
[null,null,"58","改行コード",null,null,"X","2",null,null,"S-JISの改行コードを設定",null,null,null,null,null,null,null,null,null,null,null,null,null,"","","","",null,"59","取引先区分（二次店）",null,null,"X",1]
[null,null,null,null,null,null,null,null,null,null,null,null,null,null,null,null,null,null,null,null,null,"　※ 配信分割時",null,null,"","","","",null,"60","取引先区分（三次店）",null,null,"X",1]
[null,null,null,null,null,null,null,null,null,null,null,null,null,null,null,null,null,null,null,null,null,null,null,null,"","","","",null,"61","取引先区分（届け先）",null,null,"X",1]
[null,null,null,null,null,null,null,null,null,null," ※ファイルの形式は、カンマ区切りの可変長形式となります。各項目の値にダブルクォート「\"」の囲みは不要です。",null,null,null,null,null,null,null,null,null,null,null,null,null,null,null,null,null,null,"62","取引先区分（チェーン店）",null,null,"X",1]
[null,null,null,null,null,null,null,null,null,null," ※画面から受信（ダウンロード）したファイルの最終行にはエンドレコードが出力されます。",null,null,null,null,null,null,null,null,null,null,null,null,null,null,null,null,null,null,"63","日本語区分（一次店）",null,null,"X",1]
[null,null,null,null,null,null,null,null,null,null,"　  エンドレコードのレイアウトは「エンドレコード」を参照してください。",null,null,null,null,null,null,null,null,null,null,null,null,null,null,null,null,null,null,"64","日本語区分（二次店）",null,null,"X",1]
[null,null,null,null,null,null,null,null,null,null," ※画面から送信（アップロード）するファイルにエンドレコードは不要です。",null,null,null,null,null,null,null,null,null,null,null,null,null,null,null,null,null,null,"65","日本語区分（三次店）",null,null,"X",1]
[null,null,null,null,null,null,null,null,null,null,null,null,null,null,null,null,null,null,null,null,null,null,null,null,null,null,null,null,null,"66","日本語区分（届け先）",null,null,"X",1]
[null,null,null,null,null,null,null,null,null,null,null,null,null,null,null,null,null,null,null,null,null,null,null,null,null,null,null,null,null,"67","日本語区分（チェーン店）",null,null,"X",1]
[null,null,null,null,null,null,null,null,null,null,null,null,null,null,null,null,null,null,null,null,null,null,null,null,null,null,null,null,null,"68","日本語区分（住所）",null,null,"X",1]
[null,null,null,null,null,null,null,null,null,null,null,null,null,null,null,null,null,null,null,null,null,null,null,null,null,null,null,null,null,"69","日本語区分（摘要）",null,null,"X",1]
[null,null,null,null,null,null,null,null,null,null,null,null,null,null,null,null,null,null,null,null,null,null,null,null,null,null,null,null,null,"70","ヘッダー連携エリア",null,null,"X",20]
[null,null,null,null,null,null,null,null,null,null,null,null,null,null,null,null,null,null,null,null,null,null,null,null,null,null,null,null,null,null,"明細部　　　　　　　　　　　　　　　　　　　　　　　　　　　　　　　　　　　　　　　　"]
[null,null,null,null,null,null,null,null,null,null,null,null,null,null,null,null,null,null,null,null,null,null,null,null,null,null,null,null,null,"71",null,"明細行NO",null,9,2,null,"◎"]
[null,null,null,null,null,null,null,null,null,null,null,null,null,null,null,null,null,null,null,null,null,null,null,null,null,null,null,null,null,"72",null,"専用伝票行NO",null,9,2]
[null,null,null,null,null,null,null,null,null,null,null,null,null,null,null,null,null,null,null,null,null,null,null,null,null,null,null,null,null,"73",null,"商品コード識別区分",null,9,1,null,"○"]
[null,null,null,null,null,null,null,null,null,null,null,null,null,null,null,null,null,null,null,null,null,null,null,null,null,null,null,null,null,"74",null,"品番",null,"X",16,null,"○"]
[null,null,null,null,null,null,null,null,null,null,null,null,null,null,null,null,null,null,null,null,null,null,null,null,null,null,null,null,null,"75",null,"商品名",null,"X/N",40,null,"○"]
[null,null,null,null,null,null,null,null,null,null,null,null,null,null,null,null,null,null,null,null,null,null,null,null,null,null,null,null,null,"76",null,"包装区分",null,9,1,null,"◎"]
[null,null,null,null,null,null,null,null,null,null,null,null,null,null,null,null,null,null,null,null,null,null,null,null,null,null,null,null,null,"77",null,"内容","ボール内バラ数",9,4,2,"○"]
[null,null,null,null,null,null,null,null,null,null,null,null,null,null,null,null,null,null,null,null,null,null,null,null,null,null,null,null,null,"78",null,null,"ケース内ボール数",9,2,null,"○"]
[null,null,null,null,null,null,null,null,null,null,null,null,null,null,null,null,null,null,null,null,null,null,null,null,null,null,null,null,null,"79",null,"数量符号",null,"X",1,null,"○"]
[null,null,null,null,null,null,null,null,null,null,null,null,null,null,null,null,null,null,null,null,null,null,null,null,null,null,null,null,null,"80",null,"数量","ケース数量",9,7,null,"○"]
[null,null,null,null,null,null,null,null,null,null,null,null,null,null,null,null,null,null,null,null,null,null,null,null,null,null,null,null,null,"81",null,null,"ボール数量",9,7,null,"○"]
[null,null,null,null,null,null,null,null,null,null,null,null,null,null,null,null,null,null,null,null,null,null,null,null,null,null,null,null,null,"82",null,null,"バラ数量",9,7,2,"○"]
[null,null,null,null,null,null,null,null,null,null,null,null,null,null,null,null,null,null,null,null,null,null,null,null,null,null,null,null,null,"83",null,"単価","卸店入価格",9,6,2,"○"]
[null,null,null,null,null,null,null,null,null,null,null,null,null,null,null,null,null,null,null,null,null,null,null,null,null,null,null,null,null,"84",null,null,"二次店納入価格",9,6,2]
[null,null,null,null,null,null,null,null,null,null,null,null,null,null,null,null,null,null,null,null,null,null,null,null,null,null,null,null,null,"85",null,"金額符号",null,"X",1,null,"○"]
[null,null,null,null,null,null,null,null,null,null,null,null,null,null,null,null,null,null,null,null,null,null,null,null,null,null,null,null,null,"86",null,"金額","卸店入金額",9,8,null,"○"]
[null,null,null,null,null,null,null,null,null,null,null,null,null,null,null,null,null,null,null,null,null,null,null,null,null,null,null,null,null,"87",null,null,"二次店納入金額",9,8]
[null,null,null,null,null,null,null,null,null,null,null,null,null,null,null,null,null,null,null,null,null,null,null,null,null,null,null,null,null,"88",null,"商品添付区分",null,"X",1,null,"○"]
[null,null,null,null,null,null,null,null,null,null,null,null,null,null,null,null,null,null,null,null,null,null,null,null,null,null,null,null,null,"89",null,"欠品区分",null,9,2,null,"○"]
[null,null,null,null,null,null,null,null,null,null,null,null,null,null,null,null,null,null,null,null,null,null,null,null,null,null,null,null,null,"90",null,"入荷単位ケース数",null,9,2]
[null,null,null,null,null,null,null,null,null,null,null,null,null,null,null,null,null,null,null,null,null,null,null,null,null,null,null,null,null,"91",null,"単価計算区分",null,"X",1]
[]
[]
[null,null,null,null,null,null,null,null,null,null,null,null,null,null,null,null,null,null,null,null,null,null,null,null,null,null,null,null,null,"　"]
[]
[null,null,null,null,null,null,null,null,null,null,null,null,null,null,null,null,null,null,null,null,null,null,null,null,null,null,null,null,null,"　"]
[null,null,null,null,null,null,null,null,null,null,null,null,null,null,null,null,null,null,null,null,null,null,null,null,null,null,null,null,null,"項番","　項目",null,null,"属性","整数桁","小数桁","必須"]
[]
[null,null,null,null,null,null,null,null,null,null,null,null,null,null,null,null,null,null,null,null,null,null,null,null,null,null,null,null,null,"92",null,"卸発注行番号",null,9,2]
[null,null,null,null,null,null,null,null,null,null,null,null,null,null,null,null,null,null,null,null,null,null,null,null,null,null,null,null,null,"93",null,"卸最新在庫日付区分",null,"X",1]
[null,null,null,null,null,null,null,null,null,null,null,null,null,null,null,null,null,null,null,null,null,null,null,null,null,null,null,null,null,"94",null,"卸最新在庫日付",null,9,8]
[null,null,null,null,null,null,null,null,null,null,null,null,null,null,null,null,null,null,null,null,null,null,null,null,null,null,null,null,null,"95",null,"入庫許容日付区分",null,"X",1]
[null,null,null,null,null,null,null,null,null,null,null,null,null,null,null,null,null,null,null,null,null,null,null,null,null,null,null,null,null,"96",null,"入庫許容日付",null,9,8]
[null,null,null,null,null,null,null,null,null,null,null,null,null,null,null,null,null,null,null,null,null,null,null,null,null,null,null,null,null,"97",null,"実入庫製品日付区分",null,"X",1]
[null,null,null,null,null,null,null,null,null,null,null,null,null,null,null,null,null,null,null,null,null,null,null,null,null,null,null,null,null,"98",null,"実入庫製品日付",null,9,8]
[null,null,null,null,null,null,null,null,null,null,null,null,null,null,null,null,null,null,null,null,null,null,null,null,null,null,null,null,null,"99",null,"製造ロット番号",null,"X",10]
[null,null,null,null,null,null,null,null,null,null,null,null,null,null,null,null,null,null,null,null,null,null,null,null,null,null,null,null,null,"100",null,"温度管理区分",null,"X",1]
[null,null,null,null,null,null,null,null,null,null,null,null,null,null,null,null,null,null,null,null,null,null,null,null,null,null,null,null,null,"101","   ③ トレーラレコード","製品容器区分",null,9,1]
[null,null,null,null,null,null,null,null,null,null,null,null,null,null,null,null,null,null,null,null,null,null,null,null,null,null,null,null,null,"102",null,"外箱GTIN(ITF)コード",null,"X",14]
[null,null,null,null,null,null,null,null,null,null,null,null,null,null,null,null,null,null,null,null,null,null,null,null,null,null,null,null,null,"103",null,"摘要",null,"X/N",50]
[null,null,null,null,null,null,null,null,null,null,null,null,null,null,null,null,null,null,null,null,null,null,null,null,null,null,null,null,null,"104",null,"日本語区分（商品名）",null,"X",1]
[null,null,null,null,null,null,null,null,null,null,null,null,null,null,null,null,null,null,null,null,null,null,null,null,null,null,null,null,null,"105",null,"日本語区分（摘要）",null,"X",1]
[null,null,null,null,null,null,null,null,null,null,null,null,null,null,null,null,null,null,null,null,null,null,null,null,null,null,null,null,null,"106",null,"菓子業界商品分類コード",null,"X",6]
[null,null,null,null,null,null,null,null,null,null,null,null,null,null,null,null,null,null,null,null,null,null,null,null,null,null,null,null,null,"107",null,"割戻1","割戻計算区分","X",1]
[null,null,null,null,null,null,null,null,null,null,null,null,null,null,null,null,null,null,null,null,null,null,null,null,null,null,null,null,null,"108",null,null,"割戻区分","X",1]
[null,null,null,null,null,null,null,null,null,null,null,null,null,null,null,null,null,null,null,null,null,null,null,null,null,null,null,null,null,"109",null,null,"割戻基準","X",1]
[null,null,null,null,null,null,null,null,null,null,null,null,null,null,null,null,null,null,null,null,null,null,null,null,null,null,null,null,null,"110",null,null,"割戻率／単価",9,4,2]
[null,null,null,null,null,null,null,null,null,null,null,null,null,null,null,null,null,null,null,null,null,null,null,null,null,null,null,null,null,"111",null,null,"割戻金額符号","X",1]
[null,null,null,null,null,null,null,null,null,null,null,null,null,null,null,null,null,null,null,null,null,null,null,null,null,null,null,null,null,"112",null,null,"割戻金額",9,8]
[null,null,null,null,null,null,null,null,null,null,null,null,null,null,null,null,null,null,null,null,null,null,null,null,null,null,null,null,null,"113",null,null,"割戻コード","X",5]
[null,null,null,null,null,null,null,null,null,null,null,null,null,null,null,null,null,null,null,null,null,null,null,null,null,null,null,null,null,"114",null,"割戻2","割戻計算区分","X",1]
[null,null,null,null,null,null,null,null,null,null,null,null,null,null,null,null,null,null,null,null,null,null,null,null,null,null,null,null,null,"115",null,null,"割戻区分","X",1]
[null,null,null,null,null,null,null,null,null,null,null,null,null,null,null,null,null,null,null,null,null,null,null,null,null,null,null,null,null,"116",null,null,"割戻基準","X",1]
[null,null,null,null,null,null,null,null,null,null,null,null,null,null,null,null,null,null,null,null,null,null,null,null,null,null,null,null,null,"117",null,null,"割戻率／単価",9,4,2]
[null,null,null,null,null,null,null,null,null,null,null,null,null,null,null,null,null,null,null,null,null,null,null,null,null,null,null,null,null,"118",null,null,"割戻金額符号","X",1]
[null,null,null,null,null,null,null,null,null,null,null,null,null,null,null,null,null,null,null,null,null,null,null,null,null,null,null,null,null,"119",null,null,"割戻金額",9,8]
[null,null,null,null,null,null,null,null,null,null,null,null,null,null,null,null,null,null,null,null,null,null,null,null,null,null,null,null,null,"120",null,null,"割戻コード","X",5]
[null,null,null,null,null,null,null,null,null,null,null,null,null,null,null,null,null,null,null,null,null,null,null,null,null,null,null,null,null,"121",null,"割戻3","割戻計算区分","X",1]
[null,null,null,null,null,null,null,null,null,null,null,null,null,null,null,null,null,null,null,null,null,null,null,null,null,null,null,null,null,"122",null,null,"割戻区分","X",1]
[null,null,null,null,null,null,null,null,null,null,null,null,null,null,null,null,null,null,null,null,null,null,null,null,null,null,null,null,null,"123",null,null,"割戻基準","X",1]
[null,null,null,null,null,null,null,null,null,null,null,null,null,null,null,null,null,null,null,null,null,null,null,null,null,null,null,null,null,"124",null,null,"割戻率／単価",9,4,2]
[null,null,null,null,null,null,null,null,null,null,null,null,null,null,null,null,null,null,null,null,null,null,null,null,null,null,null,null,null,"125",null,null,"割戻金額符号","X",1]
[null,null,null,null,null,null,null,null,null,null,null,null,null,null,null,null,null,null,null,null,null,null,null,null,null,null,null,null,null,"126",null,null,"割戻金額",9,8]
[null,null,null,null,null,null,null,null,null,null,null,null,null,null,null,null,null,null,null,null,null,null,null,null,null,null,null,null,null,"127",null,null,"割戻コード","X",5]
[null,null,null,null,null,null,null,null,null,null,null,null,null,null,null,null,null,null,null,null,null,null,null,null,null,null,null,null,null,"128",null,"明細連携エリア",null,"X",10]
[null,null,null,null,null,null,null,null,null,null,null,null,null,null,null,null,null,null,null,null,null,null,null,null,null,null,null,null,null,"129","レコード件数",null,null,9,6,null,"○"]
[null,null,null,null,null,null,null,null,null,null,null,null,null,null,null,null,null,null,null,null,null,null,null,null,null,null,null,null,null,"130","伝票枚数",null,null,9,6]
[null,null,null,null,null,null,null,null,null,null,null,null,null,null,null,null,null,null,null,null,null,null,null,null,null,null,null,null,null,"131","合計金額符号",null,null,"X",1]
[null,null,null,null,null,null,null,null,null,null,null,null,null,null,null,null,null,null,null,null,null,null,null,null,null,null,null,null,null,"132","合計金額",null,null,9,10]
[null,null,null,null,null,null,null,null,null,null,null,null,null,null,null,null,null,null,null,null,null,null,null,null,null,null,null,null,null,"133","連携エリア",null,null,"X",20]
[null,null,null,null,null,null,null,null,null,null,null,null,null,null,null,null,null,null,null,null,null,null,null,null,null,null,null,null,null,"134","一次店カナ名",null,null,"X",30]
[null,null,null,null,null,null,null,null,null,null,null,null,null,null,null,null,null,null,null,null,null,null,null,null,null,null,null,null,null,"135","二次店カナ名",null,null,"X",30]
[null,null,null,null,null,null,null,null,null,null,null,null,null,null,null,null,null,null,null,null,null,null,null,null,null,null,null,null,null,"136","届け先カナ名",null,null,"Ｘ","30"]
[null,null,null,null,null,null,null,null,null,null,null,null,null,null,null,null,null,null,null,null,null,null,null,null,null,null,null,null,null,"137","摘要カナ",null,null,"Ｘ","30"]
[null,null,null,null,null,null,null,null,null,null,null,null,null,null,null,null,null,null,null,null,null,null,null,null,null,null,null,null,null,"138","商品名カナ",null,null,"X","25"]
[null,null,null,null,null,null,null,null,null,null,null,null,null,null,null,null,null,null,null,null,null,null,null,null,null,null,null,null,null,"139","改行コード",null,null,"X","2"]

{"sheet":"２２出荷報告","index":5,"n_rows":160,"n_cols":40,"rows_kept":160,"cut":false,"hidden":false,"merged":[[47,8,48,8],[47,9,48,9],[47,10,48,10],[47,16,48,16],[3,1,4,1],[3,9,4,9],[3,2,4,2],[3,3,4,4],[3,6,4,6],[3,7,4,7],[3,8,4,8],[47,1,48,1],[47,2,48,2],[47,3,48,4],[47,6,48,6],[47,7,48,7],[3,34,4,34],[3,35,4,35],[3,36,4,36],[3,23,3,27],[70,10,70,15],[52,16,52,17],[3,29,4,29],[3,30,4,31],[3,33,4,33],[3,10,4,10],[3,16,4,16],[37,13,37,17],[47,23,47,27],[61,29,62,29],[61,30,62,31],[61,33,62,33],[22,22,23,22],[61,34,62,34],[61,35,62,35],[61,36,62,36],[109,30,110,31],[109,29,110,29],[109,33,110,33],[109,34,110,34],[109,35,110,35],[109,36,110,36]]}
[null,null,null,null,null,null,null,null,null,null,null,null,null,null,null,null,null,null,null,null,null,null,null,null,null,null,null,null,null,{"$f":"シート別総ページ数","v":{"$error":"#NAME?"}}]
[null,null,"（３） Ｖ１・２２出荷報告",null,null,null,null,null,null,null,null,null,null,null,null,null,null,null,null,null,null,null,null,null,null,null,null,null,null,"（3） Ｖ２・２３出荷報告"]
[null,null,"　",null,null,null,null,null,null,null,null,null,null,null,null,null,null,null,null,null,null,null,null,null,null,null,null,null,null,"　"]
[null,"変更","項番","　項目",null,null,"属性","整数桁","小数桁","必須","　項目説明",null,null,null,null,null,"　コード",null,"アップロード","Ｖ１ → Ｖ１","Ｖ１ → Ｖ２","Ｖ１ ← Ｖ１","Ｖ１ ← Ｖ２","　　　　　　　Ｖ２フォーマット",null,null,null,null,null,"項番","　項目",null,null,"属性","整数桁","小数桁","必須"]
[null,null,null,null,null,null,null,null,null,null,null,null,null,null,null,null,null,null,"チェック","センタチェック","センタチェック","コンバート","コンバート","項番","　　項目","属性","整数","小数"]
[null,null,"1","データ種別",null,null,"9",2,null,"◎","２２：出荷報告(直送)データ",null,null,null,null,null,"22",null,"必須","ｺｰﾄﾞ","ｺｰﾄﾞ","○","\"22\"固定",null,{"$f":"IF($X6=\"\",\"\",VLOOKUP($X6,$AD$6:$AK$15,2,))","v":""},{"$f":"IF($X6=\"\",\"\",VLOOKUP($X6,$AD$6:$AK$15,6,))","v":""},{"$f":"IF($X6=\"\",\"\",VLOOKUP($X6,$AD$6:$AK$15,7,))","v":""},{"$f":"IF($X6=\"\",\"\",VLOOKUP($X6,$AD$6:$AK$15,8,))","v":""},null,"1","データ種別",null,null,9,2,null,"◎"]
[null,null,"2","最終トレーラ判定区分",null,null,"X",1,null,"◎","トレーラ判定の区分",null,null,null,null,null,"9:最終","△:それ以外",null,null,null,null,"○","2",{"$f":"IF($X7=\"\",\"\",VLOOKUP($X7,$AD$6:$AK$162,2,))","v":"最終トレーラ判定区分"},{"$f":"IF($X7=\"\",\"\",VLOOKUP($X7,$AD$6:$AK$162,5,))","v":"X"},{"$f":"IF($X7=\"\",\"\",VLOOKUP($X7,$AD$6:$AK$162,6,))","v":1},{"$f":"IF($X7=\"\",\"\",VLOOKUP($X7,$AD$6:$AK$162,7,))","v":0},null,"2","最終トレーラ判定区分",null,null,"X",1,null,"◎"]
[null,null,"3","送信先コード",null,null,"9",8,null,"◎","送信先(卸)","の統一取引先コード",null,null,null,null,null,null,"必須＋属性＋桁数＋登録","センター登録","センター登録",null,"○","3","送信先コード",9,8,0,null,"3","送信先コード",null,null,9,8,null,"◎"]
[null,null,"4","送信元コード",null,null,"9",8,null,"◎","送信元(メーカ)","の統一取引先コード",null,null,null,null,null,null,"必須＋属性＋桁数＋登録","センター登録","センター登録",null,"○","4","送信元コード",9,8,0,null,"4","送信元コード",null,null,9,8,null,"◎"]
[null,null,"5","データ作成日",null,null,"9",8,null,"○","本データを作成した日付",null,"(西暦 YYYYMMDD)",null,null,null,null,null,null,null,"必須＋日付","○","○","5","データ作成日",9,8,0,null,"5","データ作成日",null,null,9,8,null,"◎"]
[null,null,"6","送信先名",null,null,"X",20,null,"○","送信元(卸)","のカナ名称",null,null,null,null,null,null,"属性",null,null,"○","○","7","送信先名","X",20,0,null,"6","データ作成時刻",null,null,9,6]
[null,null,"7","送信元名",null,null,"X",20,null,"○","送信先(メーカ)","のカナ名称",null,null,null,null,null,null,"属性",null,"必須","○","○","8","送信元名","X",20,0,null,"7","送信先名",null,null,"X",20,null,"○"]
[null,null,"8","直接送信先コード",null,null,"9",8,null,null,"送信先と異なる場所へ送信する場合にセット。　セット不要の場合\"00000000\"",null,null,null,null,null,null,null,null,"センター登録","センター登録","○","○","9","直接送信先コード",9,8,0,null,"8","送信元名",null,null,"X",20,null,"◎"]
[null,null,"9","直接送信先カナ名",null,null,"X",20,null,null,"送信先と異なる場所へ送信する場合にセット。　セット不要の場合スペース",null,null,null,null,null,null,null,"属性",null,null,"○","○","10","直接送信先名","X",20,0,null,"9","直接送信先コード",null,null,9,8]
[null,null,"10","予備０１",null,null,"X",161,null,null,"レイアウト拡張時の予備領域",null,"(利用禁止）",null,null,null,null,null,null,null,null,"○","属性初期値",null,"","","","",null,"10","直接送信先名",null,null,"X",20]
[null,null,"11","伝票NO",null,null,"9",6,null,"◎","メーカ発行伝票NO",null,null,null,null,null,null,null,"必須＋属性＋桁数",null,"属性(ｽ)","○","下６桁","14","メーカ伝票NO",9,8,0,null,"11","送信ファイルNO",null,null,9,2]
[null,null,"12","店入直送区分",null,null,"9",1,null,"○","店(倉)入れまたは直送等の区分",null,null,null,null,null,"1:店入\n","2:直送",null,null,"必須＋ｺｰﾄﾞ","○","\"1\"･\"3\" → \"1\"\n その他   → \"2\"","15","店入直送区分",9,1,0,null,"12","連携エリア",null,null,"X",20]
[null,2.7,"13","取引コード",null,null,"9",2,null,"○","業界統一取引コード",null,null,null,null,null,"11:店入売上\n12:店入売上訂正\n21:店入返品\n22:店入返品訂正\n31:直送売上\n32:直送売上訂正\n\n\n\n","41:直送返品\n42:直送返品訂正\n51:割戻し金\n52:相殺\n81:ﾒｰｶｰ提供の役務\n91:卸提供の役務",null,null,"必須＋ｺｰﾄﾞ","○","○","16","取引コード",9,2,0,null,"13","卸発注伝票NO",null,null,9,8]
[null,null,"14","取引年月日",null,null,"9",8,null,"◎","納品年月日",null,"(西暦 YYYYMMDD)",null,null,null,null,null,"必須＋属性＋桁数",null,"日付","○","○","17","取引年月日",9,8,0,null,"14","メーカ伝票NO",null,null,9,8,null,"○"]
[null,null,"15","予備０２",null,null,"X",4,null,null,"スペース",null,"(未使用)",null,null,null,null,null,null,null,null,"○","属性初期値",null,"","","","",null,"15","店入直送区分",null,null,9,1,null,"◎",null,null,"元納品日（YYMM）"]
[null,null,"16","明細行数",null,null,"9",2,null,"○","伝票内明細数",null,null,null,null,null,null,null,null,null,"属性(ｽ)","○","○","28","明細行数",9,2,0,null,"16","取引コード",null,null,9,2,null,"◎"]
[null,"2.2","17","一次店コード",null,null,"9",8,null,"◎","該当する統一取引先コード",null,null,null,null,null,null,null,"必須＋属性＋桁数",null,"必須","○","8桁以上:上8桁\n8桁未満:前ゼロ＋有効桁","29","一次店コード","X",13,0,null,"17","取引年月日",null,null,9,8,null,"○"]
[null,"2.2\n1.3","18","二次店コード",null,null,"9",8,null,null,"該当する統一取引先コード",null,null,null,null,null,null,null,"属性＋桁数",null,null,"○","GLN時:下８桁\nGLN以外8桁以上:上８桁\nGLN以外8桁未満:前ｾﾞﾛ+　　　　　\n　　　　　　　　　　　　有効桁","30","二次店コード","X",13,0,null,"18","出荷年月日",null,null,9,8]
[null,"2.2\n1.3","19","届け先コード",null,null,"9",8,null,"◎","該当する統一取引先コード",null,"(一次店・二次店と重複の場合も必須)",null,null,null,null,null,"必須＋属性＋桁数",null,null,"○",null,"32","届け先コード","X",13,0,null,"19","着荷予定日",null,null,9,8]
[null,null,"20","専用伝票日付",null,null,"9",8,null,null,"納品伝票が専用伝票の場合にセット",null,"(西暦 YYYYMMDD、セット不要の場合はゼロ)",null,null,null,null,null,null,null,"日付","○","○","34","専用伝票日付",9,8,0,null,"20","納入予定時間",null,null,9,4]
[null,null,"21","専用伝票NO",null,null,"9",9,null,null,"納品伝票が専用伝票の場合にセット",null,"(セット不要の場合はゼロ)",null,null,null,null,null,null,null,"属性(ｽ)","○","○","35","専用伝票NO",9,9,0,null,"21","倉庫コード",null,null,"X",4]
[null,null,"22","伝票合計金額符号",null,null,"X",1,null,"○","伝票合計金額の符号",null,null,null,null,null,"＋:正数","－:負数","属性",null,"ｺｰﾄﾞ","\"△\" → \"+\"","\"△\" → \"+\"","38","伝票合計金額符号","X",1,0,null,"22","伝送区分",null,null,"X",1]
[null,null,"23","伝票合計金額",null,null,"9",8,null,"◎","伝票の合計金額",null,"(卸店入価格)",null,null,null,null,null,"必須＋属性＋桁数","属性(ｻ)","属性(ｽ)","○","○","39","伝票合計金額",9,8,0,null,"23","出荷報告以外区分",null,null,"X",1]
[null,null,"24","二次店納入金額符号",null,null,"X",1,null,null,"正味納入金額の符号",null,null,null,null,null,"＋:正数","－:負数","属性",null,"ｺｰﾄﾞ","\"△\" → \"+\"","\"△\" → \"+\"","40","二次店納入合計金額符号","X",1,0,null,"24","集計明細区分",null,null,"X",1]
[null,null,"25","二次店納入合計金額",null,null,"9",8,null,null,"正味納入金額",null,"(二次店が量販店等)",null,null,null,null,null,"属性＋桁数","属性(ｻ)","属性(ｽ)","○","○","41","二次店納入合計金額",9,8,0,null,"25","請求締日",null,null,9,8]
[null,1.1000000000000001,"26","一次店カナ名",null,null,"X",30,null,"○","一次店名",null,null,null,null,null,null,null,"属性",null,null,"○","日本語区分(一次店)が\n漢字  ：一次店カナ名\nその他：一次店名","42\n135","一次店名\n一次店カナ名","X/N",40,0,null,"26","請求口座",null,null,"X",10]
[null,1.1000000000000001,"27","二次店カナ名",null,null,"X",30,null,null,"二次店名",null,null,null,null,null,null,null,"属性",null,null,"○","日本語区分(二次店)が\n漢字  ：二次店カナ名\nその他：二次店名","43\n136","二次店名\n二次店カナ名","X/N",40,0,null,"27","請求支払区分",null,null,9,2]
[null,1.1000000000000001,"28","届け先カナ名",null,null,"X",30,null,"○","届け先名",null,null,null,null,null,null,null,"属性",null,null,"○","日本語区分(届け先)が\n漢字  ：届け先カナ名\nその他：届け先名","45\n137","届け先名\n届け先カナ名","X/N",40,0,null,"28","明細行数",null,null,9,2]
[null,null,"29","元伝日付",null,null,"9",8,null,null,"メーカで訂正した場合に元伝票の納品日をセット",null,null,"(西暦 YYYYMMDD)",null,null,null,null,null,null,"日付","○","○","36",{"$f":"IF($X34=\"\",\"\",VLOOKUP($X34,$AD$6:$AK$162,2,))","v":"元伝年月日"},{"$f":"IF($X34=\"\",\"\",VLOOKUP($X34,$AD$6:$AK$162,5,))","v":9},{"$f":"IF($X34=\"\",\"\",VLOOKUP($X34,$AD$6:$AK$162,6,))","v":8},{"$f":"IF($X34=\"\",\"\",VLOOKUP($X34,$AD$6:$AK$162,7,))","v":0},null,"29","一次店コード",null,null,"X",13,null,"◎"]
[null,null,"30","元伝NO",null,null,"9",6,null,null,"メーカで訂正した場合に元伝票の伝票NOをセット",null,null,"(前ゼロ)",null,null,null,null,null,null,"属性(ｽ)","○","下６桁","37",{"$f":"IF($X35=\"\",\"\",VLOOKUP($X35,$AD$6:$AK$162,2,))","v":"元伝NO"},{"$f":"IF($X35=\"\",\"\",VLOOKUP($X35,$AD$6:$AK$162,5,))","v":9},{"$f":"IF($X35=\"\",\"\",VLOOKUP($X35,$AD$6:$AK$162,6,))","v":8},{"$f":"IF($X35=\"\",\"\",VLOOKUP($X35,$AD$6:$AK$162,7,))","v":0},null,"30","二次店コード",null,null,"X",13]
[null,1.1000000000000001,"31","摘要欄",null,null,"X",30,null,null,"伝票の摘要欄の内容",null,null,null,null,null,null,null,"属性",null,null,"○","日本語区分(摘要)が\n漢字  ：摘要カナ\nその他：摘要","49\n138","摘要\n摘要カナ","X/N\nX","50\n30",0,null,"31","三次店コード",null,null,"X",13]
[null,null,"32","メーカ所属組織名",null,null,"X",10,null,null,"メーカの伝発組織名",null,null,null,null,null,null,null,"属性",null,null,"○","○","51",{"$f":"IF($X37=\"\",\"\",VLOOKUP($X37,$AD$6:$AK$162,2,))","v":"メーカ所属組織名"},{"$f":"IF($X37=\"\",\"\",VLOOKUP($X37,$AD$6:$AK$162,5,))","v":"X"},{"$f":"IF($X37=\"\",\"\",VLOOKUP($X37,$AD$6:$AK$162,6,))","v":10},{"$f":"IF($X37=\"\",\"\",VLOOKUP($X37,$AD$6:$AK$162,7,))","v":0},null,"32","届け先コード",null,null,"X",13,null,"○"]
[null,null,"33","伝票区分",null,null,"9",1,null,"○","伝票発行の区分",null,null,"0:菓子統一伝票\n1:ﾁｪｰﾝｽﾄｱ統一伝票　　     (OCR、タイプ用で伝票№が印刷されていないもの)\n2:専用伝票            　　   (専用伝票(チェーンストア統一伝票手書用を含む)で\n                                         専用伝票No.をレコード中に表示できるもの)\n3:専用伝票だが、レコード中に元伝№を表示できないもの\n4:チェーンストア統一伝票  （ターンアラウンド用）\n8:伝票レス",null,null,null,null,null,null,"ｺｰﾄﾞ(新)","○","○","52","伝票区分",9,1,0,null,"33","チェーン店コード",null,null,"X",13]
[null,null,"34","卸伝票ＮＯ",null,null,"9",6,null,null,"受発注データの伝票ＮＯ  直送返品時は返品ＮＯ  受発注データで受けた場合は必ずセット",null,null,null,null,null,null,null,null,null,"属性(ｽ)","○","下６桁","13","卸発注伝票NO",9,8,0,null,"34","専用伝票日付",null,null,9,8]
[null,null,"35","定番特売区分",null,null,"X",1,null,"○","定番発注/特売発注の区分",null,null,null,null,null,"0:定番","1:特売","属性",null,null,"○","\"0\"･”1”以外→\"0\"","54","定番特売区分","X",1,0,null,"35","専用伝票NO",null,null,9,9]
[null,null,"36","登録店区分",null,null,"X",1,null,"○","メーカの登録店区分",null,null,null,null,null,"0:登録店以外","1:登録店","属性",null,"ｺｰﾄﾞ","○","○","53","登録店区分","X",1,0,null,"36","元伝年月日",null,null,9,8]
[null,null,"37","予備０３",null,null,"X",2,null,null,"レイアウト拡張時の予備領域",null,"(卸発注伝票NO８桁化対応）",null,null,null,null,null,null,null,null,"○","卸発注伝票NO上2桁","13","卸発注伝票NO",9,8,0,null,"37","元伝NO",null,null,9,8]
[null,null,"（次頁に続く）",null,null,null,null,null,null,null,null,null,null,null,null,null,null,null,null,null,null,null,null,null,null,null,null,null,null,"38","伝票合計金額符号",null,null,"X",1,null,"○"]
[null,null,null,null,null,null,null,null,null,null,null,null,null,null,null,null,null,null,null,null,null,null,null,null,null,null,null,null,null,"39","伝票合計金額",null,null,9,8,null,"○"]
[null,null,null,null,null,null,null,null,null,null,null,null,null,null,null,null,null,null,null,null,null,null,null,null,null,null,null,null,null,"40","二次店納入合計金額符号",null,null,"X",1]
[null,null,null,null,null,null,null,null,null,null,null,null,null,null,null,null,null,null,null,null,null,null,null,null,null,null,null,null,null,"41","二次店納入合計金額",null,null,9,8]
[null,null,"（前頁の続き）",null,null,null,null,null,null,null,null,null,null,null,null,null,null,null,null,null,null,null,null,null,null,null,null,null,null,"42","一次店名",null,null,"X/N",40,null,"○"]
[null,"変更","項番","　項目",null,null,"属性","整数桁","小数桁","必須","　項目説明",null,null,null,null,null,"　コード",null,"アップロード","Ｖ１ → Ｖ１","Ｖ１ → Ｖ２","Ｖ１ ← Ｖ１","Ｖ１ ← Ｖ２","　　　　　　　Ｖ２フォーマット",null,null,null,null,null,"43","二次店名",null,null,"X/N",40]
[null,null,null,null,null,null,null,null,null,null,null,null,null,null,null,null,null,null,"チェック","センタチェック","センタチェック","コンバート","コンバート","項番","　　項目","属性","整数","小数",null,"44","三次店名",null,null,"X/N",40]
[null,null,null,"明細部　　　　　　　　　　　　　　　　　　　　　　　　　　　　　　　　　　　　　　　　",null,null,null,null,null,null,null,null,null,null,null,null,null,null,null,null,null,null,null,null,null,null,null,null,null,"45","届け先名",null,null,"X/N",40,null,"○"]
[null,null,"38",null,"行ＮＯ",null,"9",2,null,"○","明細行ＮＯ",null,null,null,null,null,"01～06",null,null,null,"属性(ｽ)","○","○","71",{"$f":"IF($X51=\"\",\"\",VLOOKUP($X51,$AD$6:$AK$162,3,))","v":"明細行NO"},{"$f":"IF($X51=\"\",\"\",VLOOKUP($X51,$AD$6:$AK$162,5,))","v":9},{"$f":"IF($X51=\"\",\"\",VLOOKUP($X51,$AD$6:$AK$162,6,))","v":2},{"$f":"IF($X51=\"\",\"\",VLOOKUP($X51,$AD$6:$AK$162,7,))","v":0},null,"46","チェーン店名",null,null,"X/N",40]
[null,null,"39",null,"専用伝票行ＮＯ",null,"9",2,null,null,"専用伝票の行ＮＯ",null,null,null,null,null,null,null,null,null,"属性(ｽ)","○","○","72",{"$f":"IF($X52=\"\",\"\",VLOOKUP($X52,$AD$6:$AK$162,3,))","v":"専用伝票行NO"},{"$f":"IF($X52=\"\",\"\",VLOOKUP($X52,$AD$6:$AK$162,5,))","v":9},{"$f":"IF($X52=\"\",\"\",VLOOKUP($X52,$AD$6:$AK$162,6,))","v":2},{"$f":"IF($X52=\"\",\"\",VLOOKUP($X52,$AD$6:$AK$162,7,))","v":0},null,"47","電話番号",null,null,"X",15]
[null,null,"40",null,"商品コード識別区分",null,"X",1,null,"○","業界統一取引コード",null,null,null,null,null,"0:統一商品コード\n1:ＩＴＦコード(14桁)\n2:ＩＴＦｺｰﾄﾞ(拡張16桁)\n3:JANコード(標準:13桁)\n4:JANコード(短縮:8桁)\n6:GTINコード(14桁)",null,"属性",null,"必須＋コード(新)\n\n\"2\"は連携不可","○","○","73",{"$f":"IF($X53=\"\",\"\",VLOOKUP($X53,$AD$6:$AK$162,3,))","v":"商品コード識別区分"},{"$f":"IF($X53=\"\",\"\",VLOOKUP($X53,$AD$6:$AK$162,5,))","v":9},{"$f":"IF($X53=\"\",\"\",VLOOKUP($X53,$AD$6:$AK$162,6,))","v":1},{"$f":"IF($X53=\"\",\"\",VLOOKUP($X53,$AD$6:$AK$162,7,))","v":0},null,"48","住所",null,null,"X/N",80]
[null,null,"41",null,"品番",null,"X",16,null,"○","統一商品ｺｰﾄﾞ，ITFｺｰﾄﾞ，JANｺｰﾄﾞまたはGTINｺｰﾄﾞ（左詰め）",null,null,null,null,null,null,null,"属性",null,null,"○","○","74",{"$f":"IF($X54=\"\",\"\",VLOOKUP($X54,$AD$6:$AK$162,3,))","v":"品番"},{"$f":"IF($X54=\"\",\"\",VLOOKUP($X54,$AD$6:$AK$162,5,))","v":"X"},{"$f":"IF($X54=\"\",\"\",VLOOKUP($X54,$AD$6:$AK$162,6,))","v":16},{"$f":"IF($X54=\"\",\"\",VLOOKUP($X54,$AD$6:$AK$162,7,))","v":0},null,"49","摘要",null,null,"X/N",50]
[null,1.1000000000000001,"42",null,"商品名",null,"X",25,null,"○","商品名",null,null,null,null,null,null,null,"属性",null,null,"○","日本語区分(商品名)が\n漢字  ：商品名カナ\nその他：商品名","75\n139","商品名\n商品名カナ","X/N\nX","40\n25",0,null,"50","メーカコード",null,null,"X",9]
[null,null,"43",null,"包装区分",null,"9",1,null,"○","数量の発注単位の区分",null,"(1:ケース発注時)","(2:ボール発注時)","(3:バラ発注時)",null,"1:ケース発注\n2:ボール発注","3:バラ発注",null,null,"必須＋ｺｰﾄﾞ","○","○","77",{"$f":"IF($X56=\"\",\"\",VLOOKUP($X56,$AD$6:$AK$162,3,))","v":"内容"},{"$f":"IF($X56=\"\",\"\",VLOOKUP($X56,$AD$6:$AK$162,5,))","v":9},{"$f":"IF($X56=\"\",\"\",VLOOKUP($X56,$AD$6:$AK$162,6,))","v":4},{"$f":"IF($X56=\"\",\"\",VLOOKUP($X56,$AD$6:$AK$162,7,))","v":2},null,"51","メーカ所属組織名",null,null,"X",10]
[null,null,"44",null,"内容","ボール内バラ数","9",4,2,"◎","包装区分に準じた設定",null,"(ボール内バラ数","/ボール内バラ数","/ゼロ)",null,null,null,"必須＋属性＋桁数",null,"属性(ｽ)","○","○","78",{"$f":"IF($X57=\"\",\"\",VLOOKUP($X57,$AD$6:$AK$162,4,))","v":"ケース内ボール数"},9,2,0]
[null,null,"45",null,null,"ケース内ボール数","9",2,null,"◎","包装区分に準じた設定",null,"(ケース内ボール数","/ゼロ","/ゼロ)",null,null,null,"必須＋属性＋桁数",null,"属性(ｽ)","○","○","79",{"$f":"IF($X58=\"\",\"\",VLOOKUP($X58,$AD$6:$AK$162,4,))","v":0},"X",1,0]
[null,null,"46",null,"数量符号",null,"X",1,null,"○","数量の符号",null,null,null,null,null,"＋:正数","－:負数","属性",null,"ｺｰﾄﾞ","\"△\" → \"+\" (有効明細時)","\"△\" → \"+\"","80",{"$f":"IF($X59=\"\",\"\",VLOOKUP($X59,$AD$6:$AK$162,3,))","v":"数量"},9,7,0,null,"　"]
[null,null,"47",null,"数量","ケース数量","9",7,null,"◎","包装区分に準じた設定",null,"(ケース数量","/ゼロ","/ゼロ)",null,null,null,"必須＋属性＋桁数",null,"属性(ｽ)","○","○","81",{"$f":"IF($X60=\"\",\"\",VLOOKUP($X60,$AD$6:$AK$162,4,))","v":"ボール数量"},9,7,0]
[null,null,"48",null,null,"ボール数量","9",7,null,"◎","包装区分に準じた設定",null,"(ゼロ","/ボール数量","/ゼロ)",null,null,null,"必須＋属性＋桁数",null,"属性(ｽ)","○","○","82",{"$f":"IF($X61=\"\",\"\",VLOOKUP($X61,$AD$6:$AK$162,4,))","v":"バラ数量"},9,7,2,null,"　"]
[null,null,"49",null,null,"バラ数量","9",7,2,"◎","バラ数量",null,null,null,null,null,null,null,"必須＋属性＋桁数",null,"属性(ｽ)","○","○","83",{"$f":"IF($X62=\"\",\"\",VLOOKUP($X62,$AD$6:$AK$162,4,))","v":"卸店入価格"},9,6,2,null,"項番","　項目",null,null,"属性","整数桁","小数桁","必須"]
[null,null,"50",null,"単価","卸店入価格","9",6,2,"◎","卸店入価格",null,"(バラ単価､商品添付区分が1,2,3の場合はゼロ)",null,null,null,null,null,"必須＋属性＋桁数",null,"属性(ｽ)","○","○","84",{"$f":"IF($X63=\"\",\"\",VLOOKUP($X63,$AD$6:$AK$162,4,))","v":"二次店納入価格"},9,6,2]
[null,null,"51",null,null,"二次店納入価格","9",6,2,"◎","二次卸店等への納入価格",null,"(バラ単価､商品添付区分が1,2,3の場合はゼロ)",null,null,null,null,null,"必須＋属性＋桁数",null,"属性(ｽ)","○","○","85",{"$f":"IF($X64=\"\",\"\",VLOOKUP($X64,$AD$6:$AK$162,4,))","v":0},"X",1,0,null,"52","伝票区分",null,null,9,1,null,"○"]
[null,null,"52",null,"金額符号",null,"X",1,null,"○","金額の符号",null,null,null,null,null,"＋:正数","－:負数","属性",null,"ｺｰﾄﾞ","\"△\" → \"+\" (有効明細時)","\"△\" → \"+\"","86",{"$f":"IF($X65=\"\",\"\",VLOOKUP($X65,$AD$6:$AK$162,3,))","v":"金額"},9,8,0,null,"53","登録店区分",null,null,"X",1,null,"○"]
[null,null,"53",null,"金額","卸店入金額","9",8,null,"◎","卸店入金額",null,"(商品添付区分が1,2,3の場合はゼロ)",null,null,null,null,null,"必須＋属性＋桁数","属性(ｻ)","属性(ｽ)","○","○","87",{"$f":"IF($X66=\"\",\"\",VLOOKUP($X66,$AD$6:$AK$162,4,))","v":"二次店納入金額"},9,8,0,null,"54","定番特売区分",null,null,"X",1,null,"○"]
[null,null,"54",null,null,"二次店納入金額","9",8,null,"◎","二次卸店等への納入金額",null,"(商品添付区分が1,2,3の場合はゼロ)",null,null,null,null,null,"必須＋属性＋桁数","属性(ｻ)","属性(ｽ)","○","○","88",{"$f":"IF($X67=\"\",\"\",VLOOKUP($X67,$AD$6:$AK$162,4,))","v":0},"X",1,0,null,"55","消費税区分",null,null,"X",1]
[null,null,"55",null,"商品添付区分",null,"X",1,null,"○","添付商品扱いの区分",null,"(相対運用)",null,null,null,"△:売上 \n1:現物添付","2:見本 \n3:景品","属性",null,"ｺｰﾄﾞ(旧)","○","○","89",{"$f":"IF($X68=\"\",\"\",VLOOKUP($X68,$AD$6:$AK$162,3,))","v":"欠品区分"},9,2,0,null,"56","消費税率",null,null,9,2,1]
[null,"2.6\n2.8","56",null,"予備０４",null,"X",4,null,null,"新フォーマット連携エリア間のデータ連携",null,null,null,null,null,null,null,null,null,null,"○","○","128",{"$f":"IF($X69=\"\",\"\",VLOOKUP($X69,$AD$6:$AK$160,3,))","v":"明細連携エリア"},{"$f":"IF($X69=\"\",\"\",VLOOKUP($X69,$AD$6:$AK$160,5,))","v":"X"},{"$f":"IF($X69=\"\",\"\",VLOOKUP($X69,$AD$6:$AK$160,6,))","v":"10"},{"$f":"IF($X69=\"\",\"\",VLOOKUP($X69,$AD$6:$AK$160,7,))","v":0},null,"57","ロット不足運賃負担区分",null,null,"X",1]
[null,2.1,"57","予備０５",null,null,"X","1",null,null,"レイアウト拡張時の予備領域",null,"(利用禁止）",null,null,null,null,null,null,null,null,"○","属性初期値",null,{"$f":"IF($X70=\"\",\"\",VLOOKUP($X70,$AD$6:$AK$162,2,))","v":""},{"$f":"IF($X70=\"\",\"\",VLOOKUP($X70,$AD$6:$AK$162,5,))","v":""},{"$f":"IF($X70=\"\",\"\",VLOOKUP($X70,$AD$6:$AK$162,6,))","v":""},{"$f":"IF($X70=\"\",\"\",VLOOKUP($X70,$AD$6:$AK$162,7,))","v":""},null,"58","取引先区分（一次店）",null,null,"X",1]
[null,1.8,"58","レコード件数",null,null,"9",6,null,"○","レコードの総件数\n・データ送信側では、自身のフォーマットのレコード件数を設定する。\n・データ受信側では、当項目と実際のレコード件数の整合性チェックには利用しない。※下記【トレーラレコード連携時の留意事項】を参照のこと\n",null,null,null,null,null,null,null,"属性＋桁数","属性","属性(ｽ)","　※ センター集計値","　※ センター集計値","129","レコード件数",9,6,0,null,"59","取引先区分（二次店）",null,null,"X",1]
[null,null,"59","伝票枚数",null,null,"9",6,null,null,"伝票枚数",null,null,null,null,null,null,null,"属性＋桁数","属性","属性(ｽ)","　※ センター集計値","　※ センター集計値","130","伝票枚数",9,6,0,null,"60","取引先区分（三次店）",null,null,"X",1]
[null,null,"60","合計金額符号",null,null,"X",1,null,null,"合計金額の符号",null,null,null,null,null,"＋:正数","－:負数","属性",null,"ｺｰﾄﾞ","　　   \"△\" → \"+\"\n　※ センター設定　 ","　　   \"△\" → \"+\"\n　※ センター設定　 ","131","合計金額符号","X",1,0,null,"61","取引先区分（届け先）",null,null,"X",1]
[null,null,"61","合計金額",null,null,"9",10,null,null,"卸店入価格で全明細行の金額合計",null,null,null,null,null,null,null,"属性＋桁数","属性(ｻ)","属性(ｽ)","　※ センター集計値","　※ センター集計値","132","合計金額",9,10,0,null,"62","取引先区分（チェーン店）",null,null,"X",1]
[null,null,"62","予備０６",null,null,"X",214,null,null,"レイアウト拡張時の予備領域",null,"(利用禁止）",null,null,null,null,null,null,null,null,"○","属性初期値",null,"","","","",null,"63","日本語区分（一次店）",null,null,"X",1]
[null,null,"63","一次店漢字名",null,null,"X",60,null,null,"漢字OP廃止",null,"(利用禁止）",null,null,null,null,null,null,null,null,null,null,null,"","","","",null,"64","日本語区分（二次店）",null,null,"X",1]
[null,null,"64","二次店漢字名",null,null,"X",60,null,null,"漢字OP廃止",null,"(利用禁止）",null,null,null,null,null,null,null,null,null,null,null,"","","","",null,"65","日本語区分（三次店）",null,null,"X",1]
[null,null,"65","届け先漢字名",null,null,"X",60,null,null,"漢字OP廃止",null,"(利用禁止）",null,null,null,null,null,null,null,null,null,null,null,"","","","",null,"66","日本語区分（届け先）",null,null,"X",1]
[null,null,"66","摘要欄０２",null,null,"X",50,null,null,"漢字OP廃止",null,"(利用禁止）",null,null,null,null,null,null,null,null,null,null,null,"","","","",null,"67","日本語区分（チェーン店）",null,null,"X",1]
[null,null,"67","予備０７",null,null,"X",7,null,null,"漢字OP廃止",null,"(利用禁止）",null,null,null,null,null,null,null,null,null,null,null,"","","","",null,"68","日本語区分（住所）",null,null,"X",1]
[null,"2.1\n2.0","68","税率区分",null,null,"X","1",null,"○","税率区分",null,null,null,null,null,"△/0:軽減税率","1:標準税率",null,null,"ｺｰﾄﾞ","○","100 → \"1\"､その他 → \"△\"","55","消費税区分","X",1,0,null,"69","日本語区分（摘要）",null,null,"X",1]
[null,2.8,"69","資産譲渡日付",null,null,"X",4,null,null,"資産譲渡日付",null,"(西暦 YYMM)",null,null,null,null,null,null,null,null,"○","○","139","資産譲渡日付","X","4",0,null,"70","ヘッダー連携エリア",null,null,"X",20]
[null,null,"70","改行コード",null,null,"X","2",null,null,"S-JISの改行コードを設定",null,null,null,null,null,null,null,null,null,null,null,null,null,"","","","",null,null,"明細部　　　　　　　　　　　　　　　　　　　　　　　　　　　　　　　　　　　　　　　　"]
[null,null,null,null,null,null,null,null,null,null,null,null,null,null,null,null,null,null,null,null,null,"　※ 配信分割時",null,null,"","","","",null,"71",null,"明細行NO",null,9,2,null,"◎"]
[null,null,null,null,null,null,null,null,null,null,null,null,null,null,null,null,null,null,null,null,null,null,null,null,"","","","",null,"72",null,"専用伝票行NO",null,9,2]
[null,null,null,null,null,null,null,null,null,null," ※ファイルの形式は、カンマ区切りの可変長形式となります。各項目の値にダブルクォート「\"」の囲みは不要です。",null,null,null,null,null,null,null,null,null,null,null,null,null,null,null,null,null,null,"73",null,"商品コード識別区分",null,9,1]
[null,null,null,null,null,null,null,null,null,null," ※画面から受信（ダウンロード）したファイルの最終行にはエンドレコードが出力されます。",null,null,null,null,null,null,null,null,null,null,null,null,null,null,null,null,null,null,"74",null,"品番",null,"X",16]
[null,null,null,null,null,null,null,null,null,null,"　  エンドレコードのレイアウトは「エンドレコード」を参照してください。",null,null,null,null,null,null,null,null,null,null,null,null,null,null,null,null,null,null,"75",null,"商品名",null,"X/N",40]
[null,null,null,null,null,null,null,null,null,null," ※画面から送信（アップロード）するファイルにエンドレコードは不要です。",null,null,null,null,null,null,null,null,null,null,null,null,null,null,null,null,null,null,"76",null,"包装区分",null,9,1,null,"◎"]
[null,null,null,null,null,null,null,null,null,null,null,null,null,null,null,null,null,null,null,null,null,null,null,null,null,null,null,null,null,"77",null,"内容","ボール内バラ数",9,4,2]
[null,null,null,null,null,null,null,null,null,null,null,null,null,null,null,null,null,null,null,null,null,null,null,null,null,null,null,null,null,"78",null,null,"ケース内ボール数",9,2]
[null,null,null,null,null,null,null,null,null,null,null,null,null,null,null,null,null,null,null,null,null,null,null,null,null,null,null,null,null,"79",null,"数量符号",null,"X",1]
[null,null,null,null,null,null,null,null,null,null,null,null,null,null,null,null,null,null,null,null,null,null,null,null,null,null,null,null,null,"80",null,"数量","ケース数量",9,7]
[null,null,null,null,null,null,null,null,null,null,null,null,null,null,null,null,null,null,null,null,null,null,null,null,null,null,null,null,null,"81",null,null,"ボール数量",9,7]
[null,null,null,null,null,null,null,null,null,null,null,null,null,null,null,null,null,null,null,null,null,null,null,null,null,null,null,null,null,"82",null,null,"バラ数量",9,7,2]
[null,null,null,null,null,null,null,null,null,null,null,null,null,null,null,null,null,null,null,null,null,null,null,null,null,null,null,null,null,"83",null,"単価","卸店入価格",9,6,2]
[null,null,null,null,null,null,null,null,null,null,null,null,null,null,null,null,null,null,null,null,null,null,null,null,null,null,null,null,null,"84",null,null,"二次店納入価格",9,6,2]
[null,null,null,null,null,null,null,null,null,null,null,null,null,null,null,null,null,null,null,null,null,null,null,null,null,null,null,null,null,"85",null,"金額符号",null,"X",1]
[null,null,null,null,null,null,null,null,null,null,null,null,null,null,null,null,null,null,null,null,null,null,null,null,null,null,null,null,null,"86",null,"金額","卸店入金額",9,8]
[null,null,null,null,null,null,null,null,null,null,null,null,null,null,null,null,null,null,null,null,null,null,null,null,null,null,null,null,null,"87",null,null,"二次店納入金額",9,8]
[null,null,null,null,null,null,null,null,null,null,null,null,null,null,null,null,null,null,null,null,null,null,null,null,null,null,null,null,null,"88",null,"商品添付区分",null,"X",1]
[null,null,null,null,null,null,null,null,null,null,null,null,null,null,null,null,null,null,null,null,null,null,null,null,null,null,null,null,null,"89",null,"欠品区分",null,9,2]
[null,null,null,null,null,null,null,null,null,null,null,null,null,null,null,null,null,null,null,null,null,null,null,null,null,null,null,null,null,"90",null,"入荷単位ケース数",null,9,2]
[null,null,null,null,null,null,null,null,null,null,null,null,null,null,null,null,null,null,null,null,null,null,null,null,null,null,null,null,null,"91",null,"単価計算区分",null,"X",1]
[]
[]
[null,null,null,null,null,null,null,null,null,null,null,null,null,null,null,null,null,null,null,null,null,null,null,null,null,null,null,null,null,"　"]
[]
[null,null,null,null,null,null,null,null,null,null,null,null,null,null,null,null,null,null,null,null,null,null,null,null,null,null,null,null,null,"　"]
[null,null,null,null,null,null,null,null,null,null,null,null,null,null,null,null,null,null,null,null,null,null,null,null,null,null,null,null,null,"項番","　項目",null,null,"属性","整数桁","小数桁","必須"]
[]
[null,null,null,null,null,null,null,null,null,null,null,null,null,null,null,null,null,null,null,null,null,null,null,null,null,null,null,null,null,"92",null,"卸発注行番号",null,9,2]
[null,null,null,null,null,null,null,null,null,null,null,null,null,null,null,null,null,null,null,null,null,null,null,null,null,null,null,null,null,"93",null,"卸最新在庫日付区分",null,"X",1]
[null,null,null,null,null,null,null,null,null,null,null,null,null,null,null,null,null,null,null,null,null,null,null,null,null,null,null,null,null,"94",null,"卸最新在庫日付",null,9,8]
[null,null,null,null,null,null,null,null,null,null,null,null,null,null,null,null,null,null,null,null,null,null,null,null,null,null,null,null,null,"95",null,"入庫許容日付区分",null,"X",1]
[null,null,null,null,null,null,null,null,null,null,null,null,null,null,null,null,null,null,null,null,null,null,null,null,null,null,null,null,null,"96",null,"入庫許容日付",null,9,8]
[null,null,null,null,null,null,null,null,null,null,null,null,null,null,null,null,null,null,null,null,null,null,null,null,null,null,null,null,null,"97",null,"実入庫製品日付区分",null,"X",1]
[null,null,null,null,null,null,null,null,null,null,null,null,null,null,null,null,null,null,null,null,null,null,null,null,null,null,null,null,null,"98",null,"実入庫製品日付",null,9,8]
[null,null,null,null,null,null,null,null,null,null,null,null,null,null,null,null,null,null,null,null,null,null,null,null,null,null,null,null,null,"99",null,"製造ロット番号",null,"X",10]
[null,null,null,null,null,null,null,null,null,null,null,null,null,null,null,null,null,null,null,null,null,null,null,null,null,null,null,null,null,"100",null,"温度管理区分",null,"X",1]
[null,null,null,null,null,null,null,null,null,null,null,null,null,null,null,null,null,null,null,null,null,null,null,null,null,null,null,null,null,"101",null,"製品容器区分",null,9,1]
[null,null,null,null,null,null,null,null,null,null,null,null,null,null,null,null,null,null,null,null,null,null,null,null,null,null,null,null,null,"102",null,"外箱GTIN(ITF)コード",null,"X",14]
[null,null,null,null,null,null,null,null,null,null,null,null,null,null,null,null,null,null,null,null,null,null,null,null,null,null,null,null,null,"103",null,"摘要",null,"X/N",50]
[null,null,null,null,null,null,null,null,null,null,null,null,null,null,null,null,null,null,null,null,null,null,null,null,null,null,null,null,null,"104",null,"日本語区分（商品名）",null,"X",1]
[null,null,null,null,null,null,null,null,null,null,null,null,null,null,null,null,null,null,null,null,null,null,null,null,null,null,null,null,null,"105",null,"日本語区分（摘要）",null,"X",1]
[null,null,null,null,null,null,null,null,null,null,null,null,null,null,null,null,null,null,null,null,null,null,null,null,null,null,null,null,null,"106",null,"菓子業界商品分類コード",null,"X",6]
[null,null,null,null,null,null,null,null,null,null,null,null,null,null,null,null,null,null,null,null,null,null,null,null,null,null,null,null,null,"107",null,"割戻1","割戻計算区分","X",1]
[null,null,null,null,null,null,null,null,null,null,null,null,null,null,null,null,null,null,null,null,null,null,null,null,null,null,null,null,null,"108",null,null,"割戻区分","X",1]
[null,null,null,null,null,null,null,null,null,null,null,null,null,null,null,null,null,null,null,null,null,null,null,null,null,null,null,null,null,"109",null,null,"割戻基準","X",1]
[null,null,null,null,null,null,null,null,null,null,null,null,null,null,null,null,null,null,null,null,null,null,null,null,null,null,null,null,null,"110",null,null,"割戻率／単価",9,4,2]
[null,null,null,null,null,null,null,null,null,null,null,null,null,null,null,null,null,null,null,null,null,null,null,null,null,null,null,null,null,"111",null,null,"割戻金額符号","X",1]
[null,null,null,null,null,null,null,null,null,null,null,null,null,null,null,null,null,null,null,null,null,null,null,null,null,null,null,null,null,"112",null,null,"割戻金額",9,8]
[null,null,null,null,null,null,null,null,null,null,null,null,null,null,null,null,null,null,null,null,null,null,null,null,null,null,null,null,null,"113",null,null,"割戻コード","X",5]
[null,null,null,null,null,null,null,null,null,null,null,null,null,null,null,null,null,null,null,null,null,null,null,null,null,null,null,null,null,"114",null,"割戻2","割戻計算区分","X",1]
[null,null,null,null,null,null,null,null,null,null,null,null,null,null,null,null,null,null,null,null,null,null,null,null,null,null,null,null,null,"115",null,null,"割戻区分","X",1]
[null,null,null,null,null,null,null,null,null,null,null,null,null,null,null,null,null,null,null,null,null,null,null,null,null,null,null,null,null,"116",null,null,"割戻基準","X",1]
[null,null,null,null,null,null,null,null,null,null,null,null,null,null,null,null,null,null,null,null,null,null,null,null,null,null,null,null,null,"117",null,null,"割戻率／単価",9,4,2]
[null,null,null,null,null,null,null,null,null,null,null,null,null,null,null,null,null,null,null,null,null,null,null,null,null,null,null,null,null,"118",null,null,"割戻金額符号","X",1]
[null,null,null,null,null,null,null,null,null,null,null,null,null,null,null,null,null,null,null,null,null,null,null,null,null,null,null,null,null,"119",null,null,"割戻金額",9,8]
[null,null,null,null,null,null,null,null,null,null,null,null,null,null,null,null,null,null,null,null,null,null,null,null,null,null,null,null,null,"120",null,null,"割戻コード","X",5]
[null,null,null,null,null,null,null,null,null,null,null,null,null,null,null,null,null,null,null,null,null,null,null,null,null,null,null,null,null,"121",null,"割戻3","割戻計算区分","X",1]
[null,null,null,null,null,null,null,null,null,null,null,null,null,null,null,null,null,null,null,null,null,null,null,null,null,null,null,null,null,"122",null,null,"割戻区分","X",1]
[null,null,null,null,null,null,null,null,null,null,null,null,null,null,null,null,null,null,null,null,null,null,null,null,null,null,null,null,null,"123",null,null,"割戻基準","X",1]
[null,null,null,null,null,null,null,null,null,null,null,null,null,null,null,null,null,null,null,null,null,null,null,null,null,null,null,null,null,"124",null,null,"割戻率／単価",9,4,2]
[null,null,null,null,null,null,null,null,null,null,null,null,null,null,null,null,null,null,null,null,null,null,null,null,null,null,null,null,null,"125",null,null,"割戻金額符号","X",1]
[null,null,null,null,null,null,null,null,null,null,null,null,null,null,null,null,null,null,null,null,null,null,null,null,null,null,null,null,null,"126",null,null,"割戻金額",9,8]
[null,null,null,null,null,null,null,null,null,null,null,null,null,null,null,null,null,null,null,null,null,null,null,null,null,null,null,null,null,"127",null,null,"割戻コード","X",5]
[null,null,null,null,null,null,null,null,null,null,null,null,null,null,null,null,null,null,null,null,null,null,null,null,null,null,null,null,null,"128",null,"明細連携エリア",null,"X","10"]
[null,null,null,null,null,null,null,null,null,null,null,null,null,null,null,null,null,null,null,null,null,null,null,null,null,null,null,null,null,"129","レコード件数",null,null,9,6,null,"○"]
[null,null,null,null,null,null,null,null,null,null,null,null,null,null,null,null,null,null,null,null,null,null,null,null,null,null,null,null,null,"130","伝票枚数",null,null,9,6]
[null,null,null,null,null,null,null,null,null,null,null,null,null,null,null,null,null,null,null,null,null,null,null,null,null,null,null,null,null,"131","合計金額符号",null,null,"X",1]
[null,null,null,null,null,null,null,null,null,null,null,null,null,null,null,null,null,null,null,null,null,null,null,null,null,null,null,null,null,"132","合計金額",null,null,9,10]
[null,null,null,null,null,null,null,null,null,null,null,null,null,null,null,null,null,null,null,null,null,null,null,null,null,null,null,null,null,"133","連携エリア",null,null,"X",20]
[null,null,null,null,null,null,null,null,null,null,null,null,null,null,null,null,null,null,null,null,null,null,null,null,null,null,null,null,null,"134","一次店カナ名",null,null,"X",30]
[null,null,null,null,null,null,null,null,null,null,null,null,null,null,null,null,null,null,null,null,null,null,null,null,null,null,null,null,null,"135","二次店カナ名",null,null,"X",30]
[null,null,null,null,null,null,null,null,null,null,null,null,null,null,null,null,null,null,null,null,null,null,null,null,null,null,null,null,null,"136","届け先カナ名",null,null,"X",30]
[null,null,null,null,null,null,null,null,null,null,null,null,null,null,null,null,null,null,null,null,null,null,null,null,null,null,null,null,null,"137","摘要カナ",null,null,"X",30]
[null,null,null,null,null,null,null,null,null,null,null,null,null,null,null,null,null,null,null,null,null,null,null,null,null,null,null,null,null,"138","商品名カナ",null,null,"X",25]
[null,null,null,null,null,null,null,null,null,null,null,null,null,null,null,null,null,null,null,null,null,null,null,null,null,null,null,null,null,"139","資産譲渡日付",null,null,"X","4"]
[null,null,null,null,null,null,null,null,null,null,null,null,null,null,null,null,null,null,null,null,null,null,null,null,null,null,null,null,null,"140","改行コード",null,null,"X","2"]

{"sheet":"４２販売報告","index":6,"n_rows":79,"n_cols":37,"rows_kept":79,"cut":false,"hidden":false,"merged":[[37,10,37,15],[3,1,4,1],[28,16,28,17],[3,10,4,10],[3,16,4,16],[3,2,4,2],[3,9,4,9],[3,3,4,4],[3,6,4,6],[3,7,4,7],[3,8,4,8],[19,22,20,22],[3,29,4,29],[3,30,4,31],[58,35,59,35],[58,36,59,36],[3,23,3,27],[3,33,4,33],[3,34,4,34],[58,29,59,29],[58,30,59,31],[58,33,59,33],[58,34,59,34],[3,35,4,35],[3,36,4,36]]}
[null,null,null,null,null,null,null,null,null,null,null,null,null,null,null,null,null,null,null,null,null,null,null,null,null,null,null,null,null,{"$f":"シート別総ページ数","v":{"$error":"#NAME?"}}]
[null,null,"（４） Ｖ１・４２販売報告",null,null,null,null,null,null,null,null,null,null,null,null,null,null,null,null,null,null,null,null,null,null,null,null,null,null,"（６） Ｖ２・４３販売報告"]
[null,null,"　",null,null,null,null,null,null,null,null,null,null,null,null,null,null,null,null,null,null,null,null,null,null,null,null,null,null,"　"]
[null,"変更","項番","　項目",null,null,"属性","整数桁","小数桁","必須","　項目説明",null,null,null,null,null,"　コード",null,"アップロード","Ｖ１ → Ｖ１","Ｖ１ → Ｖ２","Ｖ１ ← Ｖ１","Ｖ１ ← Ｖ２","　　　　　　　Ｖ２フォーマット",null,null,null,null,null,"項番","　項目",null,null,"属性","整数桁","小数桁","必須"]
[null,null,null,null,null,null,null,null,null,null,null,null,null,null,null,null,null,null,"チェック","センタチェック","センタチェック","コンバート","コンバート","項番","　　項目","属性","整数","小数"]
[null,null,"1","データ種別",null,null,"9",2,null,"◎","４２：販売報告(店出)データ",null,null,null,null,null,"42",null,"必須","ｺｰﾄﾞ","ｺｰﾄﾞ","○","\"42\"固定",null,{"$f":"IF($X6=\"\",\"\",VLOOKUP($X6,$AD$6:$AK$15,2,))","v":""},{"$f":"IF($X6=\"\",\"\",VLOOKUP($X6,$AD$6:$AK$15,6,))","v":""},{"$f":"IF($X6=\"\",\"\",VLOOKUP($X6,$AD$6:$AK$15,7,))","v":""},{"$f":"IF($X6=\"\",\"\",VLOOKUP($X6,$AD$6:$AK$15,8,))","v":""},null,"1","データ種別",null,null,9,2,null,"◎"]
[null,null,"2","最終トレーラ判定区分",null,null,"X",1,null,"◎","トレーラ判定の区分",null,null,null,null,null,"9:最終","△:それ以外",null,null,null,null,"○","2",{"$f":"IF($X7=\"\",\"\",VLOOKUP($X7,$AD$6:$AK$81,2,))","v":"最終トレーラ判定区分"},{"$f":"IF($X7=\"\",\"\",VLOOKUP($X7,$AD$6:$AK$81,5,))","v":"X"},{"$f":"IF($X7=\"\",\"\",VLOOKUP($X7,$AD$6:$AK$81,6,))","v":1},{"$f":"IF($X7=\"\",\"\",VLOOKUP($X7,$AD$6:$AK$81,7,))","v":0},null,"2","最終トレーラ判定区分",null,null,"X",1,null,"◎"]
[null,null,"3","送信先コード",null,null,"9",8,null,"◎","送信先(メーカ)","の統一取引先コード",null,null,null,null,null,null,"必須＋属性＋桁数＋登録","センター登録","センター登録",null,"○","3","送信先コード",9,8,0,null,"3","送信先コード",null,null,9,8,null,"◎"]
[null,null,"4","送信元コード",null,null,"9",8,null,"◎","送信元(卸)     ","の統一取引先コード",null,null,null,null,null,null,"必須＋属性＋桁数＋登録","センター登録","センター登録",null,"○","4","送信元コード",9,8,0,null,"4","送信元コード",null,null,9,8,null,"◎"]
[null,null,"5","データ作成日",null,null,"9",8,null,"○","本データを作成した日付",null,"(西暦 YYYYMMDD)",null,null,null,null,null,null,null,"必須＋日付","○","○","5","データ作成日",9,8,0,null,"5","データ作成日",null,null,9,8,null,"◎"]
[null,null,"6","送信先名",null,null,"X",20,null,"○","送信先(メーカ)","のカナ名称",null,null,null,null,null,null,"属性",null,null,"○","○","7","送信先名","X",20,0,null,"6","データ作成時刻",null,null,9,6]
[null,null,"7","送信元名",null,null,"X",20,null,"○","送信元(卸)","のカナ名称",null,null,null,null,null,null,"属性",null,"必須","○","○","8","送信元名","X",20,0,null,"7","送信先名",null,null,"X",20,null,"○"]
[null,null,"8","直接送信先コード",null,null,"9",8,null,null,"送信先と異なる場所へ送信する場合にセット。　セット不要の場合\"00000000\"",null,null,null,null,null,null,null,null,"センター登録","センター登録","○","○","9","直接送信先コード",9,8,0,null,"8","送信元名",null,null,"X",20,null,"◎"]
[null,null,"9","直接送信先カナ名",null,null,"X",20,null,null,"送信先と異なる場所へ送信する場合にセット。　セット不要の場合スペース",null,null,null,null,null,null,null,"属性",null,null,"○","○","10","直接送信先カナ名","X",20,0,null,"9","直接送信先コード",null,null,9,8]
[null,null,"10","予備０１",null,null,"X",161,null,null,"レイアウト拡張時の予備領域",null,"(利用禁止）",null,null,null,null,null,null,null,null,"○","属性初期値",null,"","","","",null,"10","直接送信先カナ名",null,null,"X",20]
[null,null,"11","対象期日(自)",null,null,"9",8,null,"◎","販売実績の該当年月日(開始日)",null,"(西暦 YYYYMMDD)",null,null,null,null,null,"必須＋属性＋桁数",null,"必須＋日付","○","○","13","対象期日（自）",9,8,0,null,"11","送信ファイルNO",null,null,9,2]
[null,null,"12","対象期日(至) ",null,null,"9",8,null,"◎","販売実績の該当年月日(終了日)",null,"(西暦 YYYYMMDD)",null,null,null,null,null,"必須＋属性＋桁数",null,"日付","○","○","14","対象期日（至）",9,8,0,null,"12","連携エリア",null,null,"X",20]
[null,null,"13","取引コード",null,null,"9",2,null,"◎","業界統一取引コード",null,null,null,null,null,"11:店入売上\n\n\n\n\n","21:店入返品","必須＋属性＋桁数",null,"ｺｰﾄﾞ","○","○","15","取引コード",9,2,0,null,"13","対象期日（自）",null,null,9,8,null,"◎"]
[null,"2.2","14","一次店コード",null,null,"9",8,null,"◎","該当する統一取引先コード",null,null,null,null,null,null,null,"必須＋属性＋桁数",null,null,"○","8桁以上:上8桁\n8桁未満:前ゼロ＋有効桁","16","一次店コード","X",13,0,null,"14","対象期日（至）",null,null,9,8,null,"○"]
[null,"2.2\n1.3","15","二次店コード",null,null,"9",8,null,null,"該当する統一取引先コード",null,null,null,null,null,null,null,"属性＋桁数",null,null,"○","GLN時:下８桁\nGLN以外8桁以上:上８桁\nGLN以外8桁未満:前ｾﾞﾛ+　　　　　\n　　　　　　　　　　　　有効桁","17","二次店コード","X",13,0,null,"15","取引コード",null,null,9,2,null,"○"]
[null,"2.2\n1.3","16","届け先コード",null,null,"9",8,null,"◎","該当する統一取引先コード　一次店、二次店と重複しても必ずセットする",null,null,null,null,null,null,null,"必須＋属性＋桁数",null,null,"○",null,"19","届け先コード","X",13,0,null,"16","一次店コード",null,null,"X",13,null,"○"]
[null,1.1000000000000001,"17","一次店カナ名",null,null,"X",30,null,"◎","一次店名",null,null,null,null,null,null,null,"必須＋属性",null,null,"○","日本語区分(一次店)が\n漢字  ：一次店カナ名\nその他：一次店名","21\n61","一次店名\n一次店カナ名","X/N\nX","40\n30",0,null,"17","二次店コード",null,null,"X",13]
[null,1.1000000000000001,"18","二次店カナ名",null,null,"X",30,null,null,"二次店名",null,null,null,null,null,null,null,"属性",null,null,"○","日本語区分(二次店)が\n漢字  ：二次店カナ名\nその他：二次店名","22\n62","二次店名\n二次店カナ名","X/N\nX","40\n30",0,null,"18","三次店コード",null,null,"X",13]
[null,1.1000000000000001,"19","届け先カナ名",null,null,"X",30,null,"◎","届け先名",null,null,null,null,null,null,null,"必須＋属性",null,null,"○","日本語区分(届け先)が\n漢字  ：届け先カナ名\nその他：届け先名","24\n63","届け先名\n届け先カナ名","X/N\nX","40\n30",0,null,"19","届け先コード",null,null,"X",13,null,"○"]
[null,null,"20","税区分",null,null,"X",1,null,null,"スペースの場合はメーカ・卸企業間の個別判断とする",null,null,null,null,null,"1:外税","2:内税","属性＋桁数",null,null,"○","○","26",{"$f":"IF($X25=\"\",\"\",VLOOKUP($X25,$AD$6:$AK$81,2,))","v":"消費税区分"},{"$f":"IF($X25=\"\",\"\",VLOOKUP($X25,$AD$6:$AK$81,5,))","v":"X"},{"$f":"IF($X25=\"\",\"\",VLOOKUP($X25,$AD$6:$AK$81,6,))","v":1},{"$f":"IF($X25=\"\",\"\",VLOOKUP($X25,$AD$6:$AK$81,7,))","v":0},null,"20","チェーン店コード",null,null,"X",13]
[null,null,"21","税率",null,null,"9",2,1,null,"消費税率 ",null,"(スペースの場合はメーカ・卸企業間の個別判断とする)",null,null,null,null,null,"属性＋桁数",null,null,"○","○","27",{"$f":"IF($X26=\"\",\"\",VLOOKUP($X26,$AD$6:$AK$81,2,))","v":"消費税率"},9,2,1,null,"21","一次店名",null,null,"X/N",40]
[null,null,"22","予備０２",null,null,"X",101,null,null,"新フォーマット連携エリア間のデータ連携",null,null,null,null,null,null,null,null,null,null,"○","○","38",{"$f":"IF($X27=\"\",\"\",VLOOKUP($X27,$AD$6:$AK$81,2,))","v":"ヘッダー連携エリア"},"X",20,0,null,"22","二次店名",null,null,"X/N",40]
[null,null,null,"明細部　　　　　　　　　　　　　　　　　　　　　　　　　　　　　　　　　　　　　　　　",null,null,null,null,null,null,null,null,null,null,null,null,null,null,null,null,null,null,null,null,{"$f":"IF($X28=\"\",\"\",VLOOKUP($X28,$AD$6:$AK$81,2,))","v":""},"","","",null,"23","三次店名",null,null,"X/N",40]
[null,null,"23",null,"商品コード識別区分",null,"X",1,null,"◎","品番(商品コード)の識別区分",null,null,null,null,null,"0:統一商品コード\n1:ＩＴＦコード(14桁)\n2:ＩＴＦｺｰﾄﾞ(拡張16桁)\n3:JANコード(標準:13桁)\n4:JANコード(短縮:8桁)\n6:GTINコード(14桁)",null,"必須＋属性＋桁数",null,"必須＋コード(新)\n\n\"2\"は連携不可","○","○","40",{"$f":"IF($X29=\"\",\"\",VLOOKUP($X29,$AD$6:$AK$81,3,))","v":"商品コード識別区分"},9,1,0,null,"24","届け先名",null,null,"X/N",40]
[null,null,"24",null,"品番",null,"X",16,null,"◎","統一商品ｺｰﾄﾞ，ITFｺｰﾄﾞ，JANｺｰﾄﾞまたはGTINｺｰﾄﾞ（左詰め）",null,null,null,null,null,null,null,"必須＋属性＋桁数",null,null,"○","○","41","品番","X",16,0,null,"25","チェーン店名",null,null,"X/N",40]
[null,null,"25",null,"バラ総数符号",null,"X",1,null,"◎","バラ総数の符号",null,null,null,null,null,"＋:正数","－:負数","必須＋属性＋桁数",null,"ｺｰﾄﾞ","\"△\"→\"+\" (有効明細時)","\"△\"→\"+\"","43","バラ総数符号","X",1,0,null,"26","消費税区分",null,null,"X",1]
[null,null,"26",null,"バラ総数",null,"9",9,null,"◎","ヘッダレコードの届け先への",null,"販売数量合計",null,null,null,null,null,"必須＋属性＋桁数",null,"属性(ｽ)","○","○","44","バラ総数",9,9,0,null,"27","消費税率",null,null,9,2,1]
[null,null,"27",null,"単価",null,"9",6,2,"◎","ヘッダレコードの届け先への",null,"販売単価",null,null,null,null,null,"必須＋属性＋桁数",null,"属性(ｽ)","○","○","48","単 価",9,7,2,null,"28","取引先区分（一次店）",null,null,"X",1]
[null,null,"28",null,"金額符号",null,"X",1,null,"◎","金額の符号",null,null,null,null,null,"＋:正数","－:負数","必須＋属性＋桁数",null,"ｺｰﾄﾞ","\"△\"→\"+\" (有効明細時)","\"△\"→\"+\"","49","金額符号","X",1,0,null,"29","取引先区分（二次店）",null,null,"X",1]
[null,null,"29",null,"金額",null,"9",10,null,"◎","ヘッダレコードの届け先への",null,"販売金額合計",null,null,null,null,null,"必須＋属性＋桁数","属性(ｻ)","属性(ｽ)","○","○","50","金額",9,10,0,null,"30","取引先区分（三次店）",null,null,"X",1]
[null,null,"30",null,"予備０３",null,"X",1,null,null,"レイアウト拡張時の予備領域",null,"(利用禁止）",null,null,null,null,null,null,null,null,"○","属性初期値",null,{"$f":"IF($X36=\"\",\"\",VLOOKUP($X36,$AD$6:$AK$81,2,))","v":""},"","","",null,"31","取引先区分（届け先）",null,null,"X",1]
[null,null,"31","予備０４",null,null,"X",2,null,null,"レイアウト拡張時の予備領域",null,"(利用禁止）",null,null,null,null,null,null,null,null,"○","属性初期値",null,"","","","",null,"32","取引先区分（チェーン店）",null,null,"X",1]
[null,1.8,"32","レコード件数",null,null,"9",6,null,"◎","レコードの総件数\n・データ送信側では、自身のフォーマットのレコード件数を設定する。\n・データ受信側では、当項目と実際のレコード件数の整合性チェックには利用しない。※下記【トレーラレコード連携時の留意事項】を参照のこと\n",null,null,null,null,null,null,null,"必須＋属性＋桁数","属性","属性(ｽ)","　  センター集計値","　  センター集計値","56","レコード件数",9,6,0,null,"33","日本語区分（一次店）",null,null,"X",1]
[null,null,"33","明細件数",null,null,"9",6,null,null,"商品明細数",null,null,null,null,null,null,null,"属性＋桁数","属性","属性(ｽ)","　  センター集計値","　  センター集計値","57","伝票枚数",9,6,0,null,"34","日本語区分（二次店）",null,null,"X",1]
[null,null,"34","合計金額符号",null,null,"X",1,null,null,"合計金額の符号",null,null,null,null,null,"＋:正数","－:負数","属性",null,"ｺｰﾄﾞ","　  センター設定　 ","　  センター設定　 ","58","合計金額符号","X",1,0,null,"35","日本語区分（三次店）",null,null,"X",1]
[null,null,"35","合計金額",null,null,"9",10,null,null,"卸店入価格で全明細行の金額合計",null,null,null,null,null,null,null,"属性＋桁数","属性(ｻ)","属性(ｽ)","　  センター集計値","　  センター集計値","59","合計金額",9,10,0,null,"36","日本語区分（届け先）",null,null,"X",1]
[null,null,"36","予備０５",null,null,"X",214,null,null,"レイアウト拡張時の予備領域",null,"(利用禁止）",null,null,null,null,null,null,null,null,"○","属性初期値",null,"","","","",null,"37","日本語区分（チェーン店）",null,null,"X",1]
[null,null,"37","改行コード",null,null,"X","2",null,null,"S-JISの改行コードを設定",null,null,null,null,null,null,null,null,null,null,null,null,null,null,null,null,null,null,"38","ヘッダー連携エリア",null,null,"X",20]
[null,null,null,null,null,null,null,null,null,null,null,null,null,null,null,null,null,null,null,null,null,null,null,null,{"$f":"IF($U44=\"\",\"\",VLOOKUP($U44,$AC$6:$AL$15,2,))","v":""},{"$f":"IF($U44=\"\",\"\",VLOOKUP($U44,$AC$6:$AL$15,6,))","v":""},{"$f":"IF($U44=\"\",\"\",VLOOKUP($U44,$AC$6:$AL$15,7,))","v":""},{"$f":"IF($U44=\"\",\"\",VLOOKUP($U44,$AC$6:$AL$15,8,))","v":""},null,"39",null,"明細行NO",null,9,3,null,"◎"]
[null,null,null,null,null,null,null,null,null,null," ※ファイルの形式は、カンマ区切りの可変長形式となります。各項目の値にダブルクォート「\"」の囲みは不要です。",null,null,null,null,null,null,null,null,null,null,null,null,null,null,null,null,null,null,"40",null,"商品コード識別区分",null,9,1,null,"○"]
[null,null,null,null,null,null,null,null,null,null," ※画面から受信（ダウンロード）したファイルの最終行にはエンドレコードが出力されます。",null,null,null,null,null,null,null,null,null,null,null,null,null,null,null,null,null,null,"41",null,"品番",null,"X",16,null,"○"]
[null,null,null,null,null,null,null,null,null,null,"　  エンドレコードのレイアウトは「エンドレコード」を参照してください。",null,null,null,null,null,null,null,null,null,null,null,null,null,null,null,null,null,null,"42",null,"商品名",null,"X/N",40]
[null,null,null,null,null,null,null,null,null,null," ※画面から送信（アップロード）するファイルにエンドレコードは不要です。",null,null,null,null,null,null,null,null,null,null,null,null,null,null,null,null,null,null,"43",null,"バラ総数符号",null,"X",1,null,"○"]
[null,null,null,null,null,null,null,null,null,null,null,null,null,null,null,null,null,null,null,null,null,null,null,null,null,null,null,null,null,"44",null,"バラ総数",null,9,9,null,"○"]
[null,null,null,null,null,null,null,null,null,null,null,null,null,null,null,null,null,null,null,null,null,null,null,null,null,null,null,null,null,"45",null,"ケース(ボール)当り入数",null,9,4]
[null,null,null,null,null,null,null,null,null,null,null,null,null,null,null,null,null,null,null,null,null,null,null,null,null,null,null,null,null,"46",null,"ケース(ボール)数",null,9,7]
[]
[]
[]
[]
[null,null,null,null,null,null,null,null,null,null,null,null,null,null,null,null,null,null,null,null,null,null,null,null,null,null,null,null,null,"　"]
[]
[null,null,null,null,null,null,null,null,null,null,null,null,null,null,null,null,null,null,null,null,null,null,null,null,null,null,null,null,null,"　"]
[null,null,null,null,null,null,null,null,null,null,null,null,null,null,null,null,null,null,null,null,null,null,null,null,null,null,null,null,null,"項番","　項目",null,null,"属性","整数桁","小数桁","必須"]
[]
[null,null,null,null,null,null,null,null,null,null,null,null,null,null,null,null,null,null,null,null,null,null,null,null,null,null,null,null,null,"47",null,"販売単価区分",null,"X",1]
[null,null,null,null,null,null,null,null,null,null,null,null,null,null,null,null,null,null,null,null,null,null,null,null,null,null,null,null,null,"48",null,"単 価",null,9,7,2,"○"]
[null,null,null,null,null,null,null,null,null,null,null,null,null,null,null,null,null,null,null,null,null,null,null,null,null,null,null,null,null,"49",null,"金額符号",null,"X",1,null,"○"]
[null,null,null,null,null,null,null,null,null,null,null,null,null,null,null,null,null,null,null,null,null,null,null,null,null,null,null,null,null,"50",null,"金額",null,9,10,null,"○"]
[null,null,null,null,null,null,null,null,null,null,null,null,null,null,null,null,null,null,null,null,null,null,null,null,null,null,null,null,null,"51",null,"特売区分",null,"X",1]
[null,null,null,null,null,null,null,null,null,null,null,null,null,null,null,null,null,null,null,null,null,null,null,null,null,null,null,null,null,"52",null,"納品日",null,9,8]
[null,null,null,null,null,null,null,null,null,null,null,null,null,null,null,null,null,null,null,null,null,null,null,null,null,null,null,null,null,"53",null,"倉出・合計区分",null,"X",1]
[null,null,null,null,null,null,null,null,null,null,null,null,null,null,null,null,null,null,null,null,null,null,null,null,null,null,null,null,null,"54",null,"日本語区分（商品名）",null,"X",1]
[null,null,null,null,null,null,null,null,null,null,null,null,null,null,null,null,null,null,null,null,null,null,null,null,null,null,null,null,null,"55",null,"菓子業界商品分類コード",null,"X",6]
[null,null,null,null,null,null,null,null,null,null,null,null,null,null,null,null,null,null,null,null,null,null,null,null,null,null,null,null,null,"56","レコード件数",null,null,9,6,null,"○"]
[null,null,null,null,null,null,null,null,null,null,null,null,null,null,null,null,null,null,null,null,null,null,null,null,null,null,null,null,null,"57","伝票枚数",null,null,9,6]
[null,null,null,null,null,null,null,null,null,null,null,null,null,null,null,null,null,null,null,null,null,null,null,null,null,null,null,null,null,"58","合計金額符号",null,null,"X",1]
[null,null,null,null,null,null,null,null,null,null,null,null,null,null,null,null,null,null,null,null,null,null,null,null,null,null,null,null,null,"59","合計金額",null,null,9,10]
[null,null,null,null,null,null,null,null,null,null,null,null,null,null,null,null,null,null,null,null,null,null,null,null,null,null,null,null,null,"60","連携エリア",null,null,"X",20]
[null,null,null,null,null,null,null,null,null,null,null,null,null,null,null,null,null,null,null,null,null,null,null,null,null,null,null,null,null,"61","一次店カナ名",null,null,"Ｘ","30"]
[null,null,null,null,null,null,null,null,null,null,null,null,null,null,null,null,null,null,null,null,null,null,null,null,null,null,null,null,null,"62","二次店カナ名",null,null,"Ｘ","30"]
[null,null,null,null,null,null,null,null,null,null,null,null,null,null,null,null,null,null,null,null,null,null,null,null,null,null,null,null,null,"63","届け先カナ名",null,null,"Ｘ","30"]
[null,null,null,null,null,null,null,null,null,null,null,null,null,null,null,null,null,null,null,null,null,null,null,null,null,null,null,null,null,"64","商品名カナ",null,null,"X","25"]
[null,null,null,null,null,null,null,null,null,null,null,null,null,null,null,null,null,null,null,null,null,null,null,null,null,null,null,null,null,"65","改行コード",null,null,"X","2"]

{"sheet":"６４取引先コード照会 ・６７取引先コード照会結果","index":7,"n_rows":34,"n_cols":30,"rows_kept":34,"cut":false,"hidden":false,"merged":[[3,16,4,16],[3,7,4,7],[3,6,4,6],[24,10,24,15],[3,2,4,2],[3,3,4,4],[3,1,4,1],[3,8,4,8],[3,9,4,9],[3,10,4,10],[13,10,13,15]]}
[null,null,null,null,null,null,null,null,null,null,null,null,null,null,null,null,null,null,null,null,null,null,null,null,null,null,null,null,null,{"$f":"シート別総ページ数","v":{"$error":"#NAME?"}}]
[null,null,"（５） Ｖ１・６４取引先コード照会／６７取引先コード照会結果"]
[null,null,"　"]
[null,"変更","項番","　項目",null,null,"属性","整数桁","小数桁","必須","　項目説明",null,null,null,null,null,"　コード",null,"アップロード","Ｖ１ → Ｖ１"]
[null,null,null,null,null,null,null,null,null,null,null,null,null,null,null,null,null,null,"チェック","センタチェック"]
[null,null,"1","データ種別",null,null,"9",2,null,"◎","６４：取引先コード照会データ、６７：取引先コード照会結果データ",null,null,null,null,null,"64/67",null,"必須","ｺｰﾄﾞ"]
[null,null,"2","送信先コード",null,null,"9",8,null,"◎","照会データの送信元コード",null,null,null,null,null,null,null,null,"センター登録"]
[null,null,"3","データ作成日",null,null,"9",8,null,"○","本データを作成した日付",null,"(西暦 YYYYMMDD)"]
[null,null,"4","送信先名",null,null,"X",20,null,"○","照会データの自社名称",null,null,null,null,null,null,null,"必須＋桁数"]
[null,null,null,"登録・照会情報"]
[null,null,"５",null,"社名",null,"X",30,null,"○","照会対象の社名","(支店名も入力)",null,null,null,null,null,null,"必須＋桁数"]
[null,null,"６",null,"郵便番号",null,"X",8,null,"○","照会対象の郵便番号",null,null,null,null,null,null,null,"必須＋桁数"]
[null,null,"７",null,"住所",null,"X",40,null,null,"照会対象の住所",null,null,null,null,null,null,null,"桁数"]
[null,2.4,"８",null,"電話番号",null,"X",12,null,null,"照会対象の電話番号\n・携帯の電話番号（\"070-\"、\"080-\"、\"090-\"で始まる番号）は、登録不可",null,null,null,null,null,null,null,"桁数"]
[null,null,"９",null,"取引先コード",null,"9",8,null,null,"照会対象の取引先コード",null,null,null,null,null,null,null,"属性＋桁数"]
[null,null,"１０",null,"自由使用",null,"X",20,null,null,"任意に使用",null,null,null,null,null,null,null,"桁数"]
[null,null,null,"登録・照会結果"]
[null,null,"11",null,"社名",null,"X",30,null,null,"照会時、取引先マスタの内容",null,"(エラー時、スペース)"]
[null,null,"12",null,"郵便番号",null,"X",8,null,null,"照会時、取引先マスタの内容",null,"(エラー時、スペース)"]
[null,null,"13",null,"住所",null,"X",40,null,null,"照会時、取引先マスタの内容",null,"(エラー時、スペース)"]
[null,null,"14",null,"電話番号",null,"X",12,null,null,"照会時、取引先マスタの内容",null,"(エラー時、スペース)"]
[null,null,"15",null,"取引先コード",null,"9",8,null,null,"照会時、取引先マスタの内容",null,"(エラー時、スペース)"]
[null,null,"16",null,"処理結果",null,"9",2,null,null,"\"11\":登録    \"20\":照会   \"60\"～:エラー"]
[null,null,"17",null,"最終使用日付",null,"9",8,null,null,"該当コードの最終使用日付"]
[null,1.8,"18","レコード件数",null,null,"9",6,null,"○","レコードの総件数\n・データ送信側では、自身のフォーマットのレコード件数を設定する。\n・データ受信側では、当項目と実際のレコード件数の整合性チェックには利用しない。※下記【トレーラレコード連携時の留意事項】を参照のこと\n",null,null,null,null,null,null,null,"属性＋桁数","属性"]
[null,null,"19","明細件数",null,null,"9",6,null,null,"照会件数",null,null,null,null,null,null,null,"属性＋桁数","属性"]
[null,null,"20","予備",null,null,"X",225,null,null,"レイアウト拡張時の予備領域",null,"(利用禁止）"]
[null,null,"21","改行コード",null,null,"X","2",null,null,"S-JISの改行コードを設定"]
[]
[]
[null,null,null,null,null,null,null,null,null,null," ※ファイルの形式は、カンマ区切りの可変長形式となります。各項目の値にダブルクォート「\"」の囲みは不要です。"]
[null,null,null,null,null,null,null,null,null,null," ※画面から受信（ダウンロード）したファイルの最終行にはエンドレコードが出力されます。"]
[null,null,null,null,null,null,null,null,null,null,"　  エンドレコードのレイアウトは「エンドレコード」を参照してください。"]
[null,null,null,null,null,null,null,null,null,null," ※画面から送信（アップロード）するファイルにエンドレコードは不要です。"]

{"sheet":"０３発注","index":8,"n_rows":132,"n_cols":39,"rows_kept":132,"cut":false,"hidden":false,"merged":[[113,8,114,8],[113,9,114,9],[113,10,114,10],[113,16,114,16],[61,1,62,1],[61,2,62,2],[61,3,62,4],[61,6,62,6],[113,1,114,1],[113,2,114,2],[113,3,114,4],[113,6,114,6],[113,7,114,7],[61,7,62,7],[61,8,62,8],[61,9,62,9],[51,16,51,17],[61,10,62,10],[61,16,62,16],[114,23,114,24],[62,23,62,24],[113,23,113,27],[61,23,61,27],[115,10,115,15],[67,16,67,17],[68,16,68,17],[65,16,65,17],[79,16,79,17],[104,16,104,17],[4,10,5,10],[4,16,5,16],[46,16,46,17],[5,23,5,24],[4,31,5,31],[4,23,4,27],[45,31,46,31],[4,1,5,1],[4,2,5,2],[4,3,5,4],[4,6,5,6],[4,9,5,9],[4,7,5,7],[4,8,5,8],[45,32,46,33],[45,38,46,38],[4,35,5,35],[4,36,5,36],[4,37,5,37],[4,38,5,38],[45,37,46,37],[45,35,46,35],[45,36,46,36],[4,32,5,33]]}
["　２． Ｖ２・Web-EDIフォーマット",null,null,null,null,null,null,null,null,null,null,null,null,null,null,null,null,null,null,null,null,null,null,null,null,null,null,null,null,null,null,{"$f":"シート別総ページ数","v":{"$error":"#NAME?"}}]
["　　　２.１  Ｖ２・ＣＳＶフォーマット"]
[null,null,"（１） Ｖ２・０３発注",null,null,null,null,null,null,null,null,null,null,null,null,null,null,null,null,null,null,null,null,null,null,null,null,null,null,null,null,"（１） Ｖ１・０２発注"]
[null,null,"　"]
[null,"変更","項番","　項目",null,null,"属性","整数桁","小数桁","必須","　項目説明",null,null,null,null,null,"　コード",null,"アップロード","V２ → Ｖ１･Ｖ２","Ｖ２→ Ｖ１","Ｖ２ ← Ｖ２","Ｖ２ ← Ｖ１","　　　　　　　Ｖ１フォーマット",null,null,null,null,null,null,null,"項番","　項目",null,null,"属性","整数桁","小数桁","必須"]
[null,null,null,null,null,null,null,null,null,null,null,null,null,null,null,null,null,null,"チェック","センタチェック","センタチェック","コンバート","コンバート","比較・  変更点",null,"項番","　　項目","属性","整数","小数"]
[null,null,"1","データ種別",null,null,9,2,null,"◎","０３：発注データ",null,null,null,null,null,"03",null,"必須","ｺｰﾄﾞ",null,"○","\"03\"固定","○","ｺｰﾄﾞ",null,{"$f":"IF($Z7=\"\",\"\",VLOOKUP($Z7,$AF$7:$AM$18,2,))","v":""},{"$f":"IF($Z7=\"\",\"\",VLOOKUP($Z7,$AF$7:$AM$18,6,))","v":""},{"$f":"IF($Z7=\"\",\"\",VLOOKUP($Z7,$AF$7:$AM$18,7,))","v":""},{"$f":"IF($Z7=\"\",\"\",VLOOKUP($Z7,$AF$7:$AM$18,8,))","v":""},null,"1","データ種別",null,null,"9",2,null,"◎"]
[null,null,"2","最終トレーラ判定区分",null,null,"X",1,null,"◎","トレーラ判定の区分",null,null,null,null,null,"9:最終","△:それ以外",null,"ｺｰﾄﾞ",null,"○","○",null,null,"2",{"$f":"IF($Z8=\"\",\"\",VLOOKUP($Z8,$AF$5:$AM$128,2,))","v":"最終トレーラ判定区分"},{"$f":"IF($Z8=\"\",\"\",VLOOKUP($Z8,$AF$5:$AM$128,5,))","v":"X"},{"$f":"IF($Z8=\"\",\"\",VLOOKUP($Z8,$AF$5:$AM$128,6,))","v":1},{"$f":"IF($Z8=\"\",\"\",VLOOKUP($Z8,$AF$5:$AM$128,7,))","v":0},null,"2","最終トレーラ判定区分",null,null,"X",1,null,"◎"]
[null,null,"3","送信先コード",null,null,9,8,null,"◎","送信先(メーカ)","の統一取引先コード",null,null,null,null,null,null,"必須＋属性＋桁数＋登録","センター登録",null,"○","○",null,null,"3",{"$f":"IF($Z9=\"\",\"\",VLOOKUP($Z9,$AF$5:$AM$128,2,))","v":"送信先コード"},{"$f":"IF($Z9=\"\",\"\",VLOOKUP($Z9,$AF$5:$AM$128,5,))","v":"9"},{"$f":"IF($Z9=\"\",\"\",VLOOKUP($Z9,$AF$5:$AM$128,6,))","v":8},{"$f":"IF($Z9=\"\",\"\",VLOOKUP($Z9,$AF$5:$AM$128,7,))","v":0},null,"3","送信先コード",null,null,"9",8,null,"◎"]
[null,null,"4","送信元コード",null,null,9,8,null,"◎","送信元(卸)     ","の統一取引先コード",null,null,null,null,null,null,"必須＋属性＋桁数＋登録","センター登録",null,"○","○",null,null,"4","送信元コード","9",8,0,null,"4","送信元コード",null,null,"9",8,null,"◎"]
[null,null,"5","データ作成日",null,null,9,8,null,"◎","データ作成日付",null,"(西暦 YYYYMMDD)",null,null,null,null,null,null,"必須＋日付","センタチェック","○","○",null,null,"5","データ作成日","9",8,0,null,"5","データ作成日",null,null,"9",8,null,"○"]
[null,null,"6","データ作成時刻",null,null,9,6,null,null,"データ作成時刻",null,"(HHMMSS)",null,null,null,null,null,null,"時刻","と同じ","○","属性初期値","◎",null,null,"","","","",null,"6","送信先名",null,null,"X",20,null,"○"]
[null,null,"7","送信先名",null,null,"X",20,null,null,"送信先(メーカ)名          ",null,"(英数カナのみ)",null,null,null,null,null,"属性",null,null,"○","○",null,null,"6","送信先名","X",20,0,null,"7","送信元名",null,null,"X",20,null,"○"]
[null,null,"8","送信元名",null,null,"X",20,null,"◎","送信元(卸)名 　          　",null,"(英数カナのみ)",null,null,null,null,null,"属性","必須",null,"○","○",null,null,"7","送信元名","X",20,0,null,"8","直接送信先コード",null,null,"9",8]
[null,null,"9","直接送信先コード",null,null,9,8,null,null,"送信先コードと異なる場合にセット          ",null,"(通常はゼロ)",null,null,null,null,null,null,"センター登録",null,"○","○",null,null,"8","直接送信先コード","9",8,0,null,"9","直接送信先カナ名",null,null,"X",20]
[null,null,"10","直接送信先名",null,null,"X",20,null,null,"直接送信先名",null,"(英数カナのみ、通常はスペース)",null,null,null,null,null,"属性",null,null,"○","○",null,null,"9","直接送信先カナ名","X",20,0,null,"10","予備０１",null,null,"X",161]
[null,null,"11","送信ファイルNO",null,null,9,2,null,null,"同時送信時の問合せ№",null,"(00～99)",null,null,null,null,null,null,"属性",null,"○","属性初期値","◎",null,null,"","","","",null,"11","卸伝票NO",null,null,"9",6,null,"○"]
[null,null,"12","連携エリア",null,null,"X",20,null,null,"旧フォーマット予備連携データ",null,"(新フォーマット間：相対利用可能エリア)",null,null,null,null,null,null,null,null,"○","○","◎",null,"10","予備０１","X",161,0,null,"12","店入直送区分",null,null,"9",1,null,"○"]
[null,null,"13","卸発注伝票NO",null,null,9,8,null,"◎","受発注データの卸伝票№",null,"(6桁→8桁に拡張、6桁運用の時は上２桁ゼロ埋め）",null,null,null,null,null,"必須＋属性＋桁数","必須＋属性",null,"○","\"00\"＋卸伝票NO","○","桁数","11","卸伝票NO","9",6,0,null,"13","取引コード",null,null,"9",2,null,"○"]
[null,null,"14","店入直送区分",null,null,9,1,null,"◎","店(倉)入れまたは直送等の区分",null,null,null,null,null,"1:店入\n2:直送\n","3:店引取\n4:直送引取",null,"必須＋コード",null,"○","○","○","ｺｰﾄﾞ","12","店入直送区分","9",1,0,null,"14","納品日",null,null,"9",8,null,"○"]
[null,2.7,"15","取引コード",null,null,9,2,null,"◎","業界統一取引コード",null,null,null,null,null,"11:店入売上\n12:店入売上訂正\n21:店入返品\n22:店入返品訂正\n31:直送売上\n32:直送売上訂正\n\n\n\n","41:直送返品\n42:直送返品訂正\n51:割戻し金\n52:相殺\n81:ﾒｰｶｰ提供の役務\n91:卸提供の役務",null,"必須＋コード",null,"○","○",null,null,"13","取引コード","9",2,0,null,"15","納入時間",null,null,"9",4]
[null,null,"16","納品日／引取日",null,null,9,8,null,"◎","卸店納品日／商品引取日",null,"(西暦 YYYYMMDD)",null,null,null,null,null,"属性＋桁数","必須＋日付",null,"○","○","○","名称","14","納品日","9",8,0,null,"16","明細行数",null,null,"9",2,null,"○"]
[null,null,"17","納入時間（自）",null,null,9,4,null,null,"納入時間指定開始時間",null,"(HHMM)",null,null,null,null,null,null,"時刻",null,"○","時刻不正 → 属性初期値",null,null,"15","納入時間","9",4,0,null,"17","一次店コード",null,null,"9",8,null,"○"]
[null,null,"18","納入時間（至）",null,null,9,4,null,null,"納入時間指定終了時間",null,"(HHMM)",null,null,null,null,null,null,"時刻",null,"○","属性初期値","◎",null,null,"","","","",null,"18","二次店コード",null,null,"9",8]
[null,null,"19","発注日",null,null,9,8,null,null,"実際の発注データの入力日",null,"(西暦 YYYYMMDD)",null,null,null,null,null,"属性＋桁数","日付",null,"○","属性初期値","◎",null,null,"","","","",null,"19","届け先コード",null,null,"9",8,null,"○"]
[null,null,"20","明細行数",null,null,9,2,null,"○","伝票内明細数",null,null,null,null,null,"00～06",null,null,"コード",null,"○","○",null,null,"16","明細行数","9",2,0,null,"20","専用伝票日付",null,null,"9",8]
[null,null,"21","一次店コード",null,null,"X",13,null,"◎","統一取引先コード(8桁）",null,null,null,"(後方スペース埋め)",null,null,null,"桁数","必須",null,"○","前詰８桁＋空白５桁","○","属性＋桁数","17","一次店コード","9",8,0,null,"21","専用伝票NO",null,null,"9",9]
[null,null,"22","二次店コード",null,null,"X",13,null,null,"統一取引先コード(8桁)",null,null,null,"(後方スペース埋め)",null,null,null,"桁数",null,null,"○","前詰８桁＋空白５桁","○","属性＋桁数","18","二次店コード","9",8,0,null,"22","伝票合計金額符号",null,null,"X",1,null,"○"]
[null,null,"23","三次店コード",null,null,"X",13,null,null,"統一取引先コード(8桁)／プライベート・コード(3～8桁)／ＧＬＮ(13桁)",null,null,null,"(後方スペース埋め)",null,null,null,"桁数",null,null,"○","属性初期値","◎",null,null,"","","","",null,"23","伝票合計金額",null,null,"9",8,null,"○"]
[null,null,"24","届け先コード",null,null,"X",13,null,"○","統一取引先コード(8桁)",null,null,null,"(後方スペース埋め)",null,null,null,"桁数",null,null,"○","前詰８桁＋空白５桁","○","属性＋桁数","19","届け先コード","9",8,0,null,"24","二次店納入合計符号",null,null,"X",1]
[null,null,"25","チェーン店コード",null,null,"X",13,null,null,"統一取引先コード(8桁)／プライベート・コード(3～8桁)／ＧＬＮ(13桁)",null,null,null,"(後方スペース埋め)",null,null,null,"桁数",null,null,"○","属性初期値","◎",null,null,"","","","",null,"25","二次店納入合計金額",null,null,"9",8]
[null,null,"26","専用伝票日付",null,null,9,8,null,null,"納品伝票が専用伝票の場合にセット",null,"(西暦 YYYYMMDD)",null,null,null,null,null,null,"日付",null,"○","○",null,null,"20","専用伝票日付","9",8,0,null,"26","一次店カナ名",null,null,"X",30,null,"○"]
[null,null,"27","専用伝票NO",null,null,9,9,null,null,"　　〃              　　　　    ",null,"(専用伝票№、左ゼロ埋め)",null,null,null,null,null,null,"属性",null,"○","○",null,null,"21","専用伝票NO","9",9,0,null,"27","二次店カナ名",null,null,"X",30]
[null,null,"28","伝票合計金額符号",null,null,"X",1,null,"○","伝票の合計金額の符号",null,null,null,null,null,"△/＋:正数","－:負数","属性","コード",null,"○","不正コード値 → \"△\"","○","ｺｰﾄﾞ","22","伝票合計金額符号","X",1,0,null,"28","届け先カナ名",null,null,"X",30,null,"○"]
[null,null,"29","伝票合計金額",null,null,9,8,null,"○","伝票の合計金額",null,"(卸店入価格、１億円未満)",null,null,null,null,null,"属性＋桁数","属性",null,"○","○",null,null,"23","伝票合計金額","9",8,0,null,"29","メーカ所属組織名",null,null,"X",10]
[null,null,"30","二次店納入合計金額符号",null,null,"X",1,null,null,"正味納入合計金額の符号",null,null,null,null,null,"△/＋:正数","－:負数","属性","コード",null,"○","不正コード値 → \"△\"","○","ｺｰﾄﾞ","24","二次店納入合計符号","X",1,0,null,"30","伝票区分",null,null,"9",1,null,"○"]
[null,null,"31","二次店納入合計金額",null,null,9,8,null,null,"正味納入合計金額",null,"(二次店納入価格、１億円未満）",null,null,null,null,null,"属性＋桁数","属性",null,"○","○",null,null,"25","二次店納入合計金額","9",8,0,null,"31","定番特売区分",null,null,"X",1,null,"○"]
[null,null,"32","一次店名",null,null,"X/N",40,null,"○","一次店名",null,"(英数カナは30文字、漢字は20文字)",null,null,null,null,null,null,null,null,"○","○","○","属性＋桁数","26","一次店カナ名","X",30,0,null,"32","摘要欄０１",null,null,"X",30]
[null,null,"33","二次店名",null,null,"X/N",40,null,null,"二次店名",null,"(英数カナは30文字、漢字は20文字)",null,null,null,null,null,null,null,null,"○","○","○","属性＋桁数","27","二次店カナ名","X",30,0,null,"33","メーカコード",null,null,"X",9,null,"○"]
[null,null,"34","三次店名",null,null,"X/N",40,null,null,"三次店名",null,"(英数カナは30文字、漢字は20文字)",null,null,null,null,null,null,null,null,"○","属性初期値","◎",null,null,"","","","",null,"34","予備０２",null,null,"X",14]
[null,null,"35","届け先名",null,null,"X/N",40,null,"○","届け先名",null,"(英数カナは30文字、漢字は20文字)",null,null,null,null,null,null,null,null,"○","○","○","属性＋桁数","28","届け先カナ名","X",30,0]
[null,null,"36","チェーン店名",null,null,"X/N",40,null,null,"チェーン店名",null,"(英数カナは30文字、漢字は20文字)",null,null,null,null,null,null,null,null,"○","属性初期値","◎",null,null,"","","",""]
[null,null,"37","電話番号",null,null,"X",15,null,null,"通常は届け先の電話番号  ",null,"(局番区切り(-)あり)",null,null,null,null,null,null,null,null,"○","属性初期値","◎",null,null,"","","",""]
[null,null,"38","住所",null,null,"X/N",80,null,null,"通常は届け先の住所         ",null,"(英数カナは60文字、漢字は40文字)",null,null,null,null,null,null,null,null,"○","属性初期値","◎",null,null,"","","",""]
[null,null,"39","メーカコード",null,null,"X",9,null,"○","７桁の場合は後ろスペース",null,"(49xxxxx / 45xxxxxxx)",null,null,null,null,null,"属性",null,null,"○","○",null,null,"33","メーカコード","X",9,0]
[null,null,"40","メーカ所属組織名",null,null,"X",10,null,null,"メーカの担当所属の組織名(英数カナ)を指定、実質スペース運用が多い",null,null,null,null,null,null,null,"属性",null,null,"○","○",null,null,"29","メーカ所属組織名","X",10,0,null,"項番","　項目",null,null,"属性","整数桁","小数桁","必須"]
[null,null,"41","伝票区分",null,null,9,1,null,"○","伝票発行の区分",null,null,null,null,null,"0:菓子統一伝票\n1:ﾁｪｰﾝｽﾄｱ伝票(伝票№なし)\n2:専用伝票      (伝票№あり)\n3:専用伝票      (伝票№なし)\n4:ﾁｪｰﾝｽﾄｱ伝票(ﾀｰﾝｱﾗｳﾝﾄﾞ型)\n8:伝票レス",null,null,"コード(新)",null,"○","○","○","ｺｰﾄﾞ","30","伝票区分","9",1,0]
[null,null,"42","定番特売区分",null,null,"X",1,null,"○","定番発注/特売発注の区分",null,null,null,null,null,"0:定番\n1:特売\n","△:分類不能","属性","コード",null,"○","\"0\"・\"1\"以外 → \"△\"","○","ｺｰﾄﾞ","31","定番特売区分","X",1,0,null,null,"明細部　　　　　　　　　　　　　　　　　　　　　　　　　　　　　　　　　　　　　　　　"]
[null,null,"43","ロット不足運賃負担区分",null,null,"X",1,null,null,"発注ロット不足になった場合の運賃負担の区分",null,null,null,null,null,"△:無指定\n1:卸負担\n","2:負担なし",null,"コード",null,"○","属性初期値","◎",null,null,"","","","",null,"35",null,"行NO",null,"9",2,null,"○"]
[null,null,"44","下請法",null,"伝票表示区分","X",1,null,null,"下請法関係の伝票表示の有無区分",null,null,null,null,null,"△:表示なし","1:表示あり",null,"コード",null,"○","属性初期値","◎",null,null,"","","","",null,"36",null,"専用伝票行NO",null,"9",2]
[null,null,"45",null,null,"伝票表示内容","X/N",80,null,null,"下請法対応メッセージ",null,"(英数カナは60文字、漢字は40文字)",null,null,null,null,null,null,null,null,"○","属性初期値","◎",null,null,"","","","",null,"37",null,"商品コード識別区分",null,"X",1,null,"○"]
[null,null,"46",null,null,"日本語区分（表示）","X",1,null,null,"下請法関係の伝票表示内容の日本語区分",null,null,null,null,null,"△/0:英数カナ\n1:　　漢字(S-JIS/JIS/JEF/IBM)",null,null,"コード",null,"○","属性初期値","◎",null,null,"","","","",null,"38",null,"品番",null,"X",16,null,"○"]
[null,null,"47",null,null,"支払期限",9,8,null,null,"支払期限を明示する場合セットする",null,"(西暦 YYYYMMDD)",null,null,null,null,null,"属性＋桁数","日付",null,"○","属性初期値","◎",null,null,"","","","",null,"39",null,"商品名",null,"X",25,null,"○"]
[null,null,"48","消費税区分",null,null,"X",1,null,null,"税区分",null,null,null,null,null,"1:外税\n2:内税\n","3:非課税\n△:個別判断",null,"コード",null,"○","属性初期値","◎",null,null,"","","","",null,"40",null,"包装区分",null,"9",1,null,"○"]
[null,null,"49","消費税率",null,null,9,2,1,null,"消費税の税率(99.9％)、ゼロ:個別判断　",null,null,"(小数点以下1桁)",null,null,null,null,"属性＋桁数","属性",null,"○","属性初期値","◎",null,null,"","","","",null,"41",null,"内容","ボール内バラ数","9",4,2,"○"]
[null,null,"50","摘要",null,null,"X/N",50,null,null,"伝票の摘要欄の内容",null,"(英数カナは50文字、漢字は25文字)",null,null,null,null,null,null,null,null,"○","○","○","属性＋桁数","32","摘要欄０１","X",30,0,null,"42",null,null,"ケース内ボール数","9",2,null,"○"]
[null,null,"（次頁に続く）",null,null,null,null,null,null,null,null,null,null,null,null,null,null,null,null,null,null,null,null,null,null,null,null,null,null,null,null,"43",null,"数量符号",null,"X",1,null,"○"]
[null,null,null,null,null,null,null,null,null,null,null,null,null,null,null,null,null,null,null,null,null,null,null,null,null,null,null,null,null,null,null,"44",null,"数量","ケース数量","9",7,null,"○"]
[null,null,"　",null,null,null,null,null,null,null,null,null,null,null,null,null,null,null,null,null,null,null,null,null,null,null,null,null,null,null,null,"45",null,null,"ボール数量","9",7,null,"○"]
[null,null,null,null,null,null,null,null,null,null,null,null,null,null,null,null,null,null,null,null,null,null,null,null,null,null,null,null,null,null,null,"46",null,null,"バラ数量","9",7,2,"○"]
[null,null,"（前頁の続き）",null,null,null,null,null,null,null,null,null,null,null,null,null,null,null,null,null,null,null,null,null,null,null,null,null,null,null,null,"47",null,"単価","卸店入価格","9",6,2,"○"]
[null,"変更","項番","　項目",null,null,"属性","整数桁","小数桁","必須","　項目説明",null,null,null,null,null,"　コード",null,"アップロード","V２ → Ｖ１･Ｖ２","Ｖ２→ Ｖ１","Ｖ２ ← Ｖ２","Ｖ２ ← Ｖ１","　　　　　　　Ｖ１フォーマット",null,null,null,null,null,null,null,"48",null,null,"二次店納入価格","9",6,2]
[null,null,null,null,null,null,null,null,null,null,null,null,null,null,null,null,null,null,"チェック","センタチェック","センタチェック","コンバート","コンバート","比較・  変更点",null,"項番","　　項目","属性","整数","小数",null,"49",null,"金額符号",null,"X",1,null,"○"]
[null,null,"51","取引先区分（一次店）",null,null,"X",1,null,null,"該当項目の取引先の属性区分",null,null,null,null,null,"△:統一取引先(8桁)",null,null,"コード",null,"○","属性初期値","◎",null,null,{"$f":"IF($Z64=\"\",\"\",VLOOKUP($Z64,$AF$5:$AM$128,2,))","v":""},{"$f":"IF($Z64=\"\",\"\",VLOOKUP($Z64,$AF$5:$AM$128,5,))","v":""},{"$f":"IF($Z64=\"\",\"\",VLOOKUP($Z64,$AF$5:$AM$128,6,))","v":""},{"$f":"IF($Z64=\"\",\"\",VLOOKUP($Z64,$AF$5:$AM$128,7,))","v":""},null,"50",null,"金額","卸店入金額","9",8,null,"○"]
[null,null,"52","取引先区分（二次店）",null,null,"X",1,null,null,"　　〃 ",null,null,null,null,null,"△:統一取引先(8桁)",null,null,"コード",null,"○","属性初期値","◎",null,null,"","","","",null,"51",null,null,"二次店納入金額","9",8]
[null,null,"53","取引先区分（三次店）",null,null,"X",1,null,null,"　　〃 ",null,null,null,null,null,"△:  統一取引先(8桁)\n6:   GLN(13桁)\n7/8:プライベートコード(卸/ﾒｰｶ)",null,null,"コード",null,"○","属性初期値","◎",null,null,"","","","",null,"52",null,"卸最新在庫日付",null,"X",5]
[null,null,"54","取引先区分（届け先）",null,null,"X",1,null,null,"　　〃 ",null,null,null,null,null,"△:統一取引先(8桁)",null,null,"コード",null,"○","属性初期値","◎",null,null,"","","","",null,"53","予備０４",null,null,"X",3]
[null,null,"55","取引先区分（チェーン店）",null,null,"X",1,null,null,"　　〃 ",null,null,null,null,null,"△:  統一取引先(8桁)\n6:   GLN(13桁)\n7/8:プライベートコード(卸/ﾒｰｶ)",null,null,"コード",null,"○","属性初期値","◎",null,null,"","","","",null,"54","レコード件数",null,null,"9",6,null,"○"]
[null,null,"56","日本語区分（一次店）",null,null,"X",1,null,null,"該当項目の日本語区分",null,null,null,null,null,"△/0:英数カナ\n1:　　漢字(S-JIS/JIS/JEF/IBM)",null,null,"コード",null,"○","属性初期値","◎",null,null,"","","","",null,"55","伝票枚数",null,null,"9",6]
[null,null,"57","日本語区分（二次店）",null,null,"X",1,null,null,"　　〃 ",null,null,null,null,null,"　　〃 ",null,null,"コード",null,"○","属性初期値","◎",null,null,"","","","",null,"56","合計金額符号",null,null,"X",1]
[null,null,"58","日本語区分（三次店）",null,null,"X",1,null,null,"　　〃 ",null,null,null,null,null,"　　〃 ",null,null,"コード",null,"○","属性初期値","◎",null,null,"","","","",null,"57","合計金額",null,null,"9",10]
[null,null,"59","日本語区分（届け先）",null,null,"X",1,null,null,"　　〃 ",null,null,null,null,null,"　　〃 ",null,null,"コード",null,"○","属性初期値","◎",null,null,"","","","",null,"58","予備０５",null,null,"X",214]
[null,null,"60","日本語区分（チェーン店）",null,null,"X",1,null,null,"　　〃 ",null,null,null,null,null,"　　〃 ",null,null,"コード",null,"○","属性初期値","◎",null,null,"","","","",null,"59","一次店漢字名",null,null,"X",60]
[null,null,"61","日本語区分（住所）",null,null,"X",1,null,null,"　　〃 ",null,null,null,null,null,"　　〃 ",null,null,"コード",null,"○","属性初期値","◎",null,null,"","","","",null,"60","二次店漢字名",null,null,"X",60]
[null,null,"62","日本語区分（摘要）",null,null,"X",1,null,null,"　　〃 ",null,null,null,null,null,"　　〃 ",null,null,"コード",null,"○","属性初期値","◎",null,null,"","","","",null,"61","届け先漢字名",null,null,"X",60]
[null,null,"63","ヘッダー連携エリア",null,null,"X",20,null,null,"旧フォーマット予備連携データ",null,"(新フォーマット間：相対利用可能エリア)",null,null,null,null,null,null,null,null,"○","○","◎",null,"34","予備０２","X",14,0,null,"62","摘要欄０２",null,null,"X",50]
[null,null,null,"明細部　　　　　　　　　　　　　　　　　　　　　　　　　　　　　　　　　　　　　　　　",null,null,null,null,null,null,null,null,null,null,null,null,null,null,null,null,null,null,null,null,null,null,"","","","",null,"63","予備０６",null,null,"X",7]
[null,null,"64",null,"明細行NO",null,9,2,null,"◎","伝票内明細数",null,null,null,null,null,"01～06",null,null,"必須＋コード",null,"○","6行変換設定","○","名称","35",{"$f":"IF($Z78=\"\",\"\",VLOOKUP($Z78,$AF$5:$AM$128,3,))","v":"行NO"},"9",2,0,null,"64","改行コード",null,null,"X","2"]
[null,null,"65",null,"専用伝票行NO",null,9,2,null,null,"専用伝票の行№",null,"(00～99)",null,null,null,null,null,null,"属性",null,"○","○",null,null,"36","専用伝票行NO","9",2,0]
[null,null,"66",null,"商品コード識別区分",null,9,1,null,"○","品番(商品コード)の識別区分",null,null,null,null,null,"0:統一商品コード\n1:ＩＴＦコード (14桁)\n2:ＩＴＦコード(16桁)  【利用停止化】\n3:JANコード    (標準:13桁)\n4:JANコード    (短縮:8桁)\n6:GTINコード  (14桁)",null,"属性","コード(新)",null,"○","○","○","属性＋コード\n2:利用停止","37","商品コード識別区分","X",1,0]
[null,null,"67",null,"品番",null,"X",16,null,"○","統一商品ｺｰﾄﾞ､ITFｺｰﾄﾞ､JANｺｰﾄﾞ､GTINｺｰﾄﾞ",null,null,"(左詰め)",null,null,null,null,"属性",null,null,"○","○","○","ITF(16)\n利用停止","38","品番","X",16,0]
[null,null,"68",null,"商品名",null,"X/N",40,null,"○","商品名",null,"(英数カナは25文字、漢字は20文字)",null,null,null,null,null,null,null,null,"○","○","○","属性＋桁数","39","商品名","X",25,0]
[null,null,"69",null,"包装区分",null,9,1,null,"○","数量の発注単位の区分",null,"(1:ケース発注時)","(2:ボール発注時)","(3:バラ発注時)",null,"1:ケース発注\n2:ボール発注\n","3:バラ発注",null,"必須＋コード",null,"○","不正コード値 → \"1\"　",null,null,"40","包装区分","9",1,0]
[null,null,"70",null,"内容","ボール内バラ数",9,4,2,"○","包装区分に準じた設定",null,"(ボール内バラ数","/ボール内バラ数","/ゼロ)",null,null,null,"属性＋桁数","属性",null,"○","○",null,null,"41",{"$f":"IF($Z84=\"\",\"\",VLOOKUP($Z84,$AF$5:$AM$128,4,))","v":"ボール内バラ数"},"9",4,2]
[null,null,"71",null,null,"ケース内ボール数",9,2,null,"○","包装区分に準じた設定",null,"(ケース内ボール数","/ゼロ","/ゼロ)",null,null,null,"属性＋桁数","属性",null,"○","○",null,null,"42",{"$f":"IF($Z85=\"\",\"\",VLOOKUP($Z85,$AF$5:$AM$128,4,))","v":"ケース内ボール数"},"9",2,0]
[null,null,"72",null,"数量符号",null,"X",1,null,"○","数量の符号",null,null,null,null,null,"△/＋:正数","－:負数","属性","コード",null,"○","○","○","コード\n2:利用停止","43",{"$f":"IF($Z86=\"\",\"\",VLOOKUP($Z86,$AF$5:$AM$128,3,))","v":"数量符号"},"X",1,0]
[null,null,"73",null,"数量","ケース数量",9,7,null,"○","包装区分に準じた設定",null,"(ケース数量","/ゼロ","/ゼロ)",null,null,null,"属性＋桁数","属性",null,"○","○",null,null,"44",{"$f":"IF($Z87=\"\",\"\",VLOOKUP($Z87,$AF$5:$AM$128,4,))","v":"ケース数量"},"9",7,0]
[null,null,"74",null,null,"ボール数量",9,7,null,"○","包装区分に準じた設定",null,"(ゼロ","/ボール数量","/ゼロ)",null,null,null,"属性＋桁数","属性",null,"○","○",null,null,"45","ボール数量","9",7,0]
[null,null,"75",null,null,"バラ数量",9,7,2,"○","包装区分に準じた設定",null,"(バラ換算数量","/バラ換算数量","バラ発注数量)",null,null,null,"属性＋桁数","属性",null,"○","○",null,null,"46","バラ数量","9",7,2]
[null,null,"76",null,"単価","卸店入価格",9,6,2,"○","卸店入価格",null,"(バラ単価)",null,null,null,null,null,"属性＋桁数","属性",null,"○","○",null,null,"47","卸店入価格","9",6,2]
[null,null,"77",null,null,"二次店納入価格",9,6,2,null,"二次卸店等への納入価格",null,"(バラ単価)",null,null,null,null,null,"属性＋桁数","属性",null,"○","○",null,null,"48","二次店納入価格","9",6,2]
[null,null,"78",null,"金額符号",null,"X",1,null,"○","金額の符号",null,null,null,null,null,"△/＋:正数","－:負数","属性","コード",null,"○","○","○","コード","49",{"$f":"IF($Z92=\"\",\"\",VLOOKUP($Z92,$AF$5:$AM$128,3,))","v":"金額符号"},"X",1,0]
[null,null,"79",null,"金額","卸店入金額",9,8,null,"○","卸店入金額",null,null,null,null,null,null,null,"属性＋桁数","属性",null,"○","○",null,null,"50",{"$f":"IF($Z93=\"\",\"\",VLOOKUP($Z93,$AF$5:$AM$128,4,))","v":"卸店入金額"},"9",8,0]
[null,null,"80",null,null,"二次店納入金額",9,8,null,null,"二次卸店等への納入金額",null,null,null,null,null,null,null,"属性＋桁数","属性",null,"○","○",null,null,"51","二次店納入金額","9",8,0]
[null,null,"81",null,"商品添付区分",null,"X",1,null,null,"添付商品扱いの区分",null,"(相対運用)",null,null,null,"△:通常商品","１:添付商品",null,"コード(新)",null,"○","属性初期値","◎",null,null,{"$f":"IF($Z95=\"\",\"\",VLOOKUP($Z95,$AF$5:$AM$128,2,))","v":""},"","",""]
[null,null,"82",null,"入荷単位ケース数",null,9,2,null,null,"荷合せ品の場合の１梱包ケース数量を指定する",null,null,null,null,null,"00～20",null,"属性＋桁数","コード",null,"○","属性初期値","◎",null,null,{"$f":"IF($Z96=\"\",\"\",VLOOKUP($Z96,$AF$5:$AM$128,2,))","v":""},"","",""]
[null,null,"83",null,"卸発注行番号",null,9,2,null,null,"卸売業での発注伝票行NO",null,"(00～99)",null,null,null,null,null,null,"属性",null,"○","属性初期値","◎",null,null,{"$f":"IF($Z97=\"\",\"\",VLOOKUP($Z97,$AF$5:$AM$128,2,))","v":""},"","",""]
[null,null,"84",null,"納入単価表示区分",null,"X",1,null,null,"在庫型センター納入時に、単価／金額を表示したくない時",null,null,null,null,null,"△:表示","1:非表示",null,"コード",null,"○","属性初期値","◎",null,null,{"$f":"IF($Z98=\"\",\"\",VLOOKUP($Z98,$AF$5:$AM$128,2,))","v":""},"","",""]
[null,null,"85",null,"卸最新在庫日付区分",null,"X",1,null,null,"卸最新在庫日付の日付区分",null,null,null,null,null,"△:未使用\n1:製造日\n","2:賞味期限",null,"コード",null,"○","属性初期値","◎",null,null,{"$f":"IF($Z99=\"\",\"\",VLOOKUP($Z99,$AF$5:$AM$128,2,))","v":""},"","",""]
[null,null,"86",null,"卸最新在庫日付",null,9,8,null,null,"賞味期限／製造日",null,"(西暦 YYYYMMDD、賞味年月表示は月末最終日）",null,null,null,null,null,"属性＋桁数","日付",null,"○","日付不正 → 属性初期値\n&当該内容を摘要に設定","○","属性+桁数","52",{"$f":"IF($Z100=\"\",\"\",VLOOKUP($Z100,$AF$5:$AM$128,3,))","v":"卸最新在庫日付"},"X",5,0]
[null,null,"87",null,"入庫許容日付区分",null,"X",1,null,null,"入庫許容日付の日付区分",null,null,null,null,null,"△:未使用\n1:製造日\n","2:賞味期限",null,"コード",null,"○","属性初期値","◎",null,null,{"$f":"IF($Z101=\"\",\"\",VLOOKUP($Z101,$AF$5:$AM$128,2,))","v":""},"","",""]
[null,null,"88",null,"入庫許容日付",null,9,8,null,null,"賞味期限／製造日",null,"(西暦 YYYYMMDD、賞味年月表示は月末最終日）",null,null,null,null,null,"属性＋桁数","日付",null,"○","属性初期値","◎",null,null,"","","",""]
[null,null,"89",null,"温度管理区分",null,"X",1,null,null,"該当商品の温度帯管理区",null,null,null,null,null,"△/0:常温\n1:28℃以下\n2:20℃以下\n\n","3:冷蔵(10℃以下)\n4:冷凍(-15℃\n                 以下)",null,"コード",null,"○","属性初期値","◎",null,null,"","","",""]
[null,null,"90",null,"摘要",null,"X/N",50,null,null,"任意使用",null,"(英数カナは50文字、漢字は25文字)",null,null,null,null,null,null,null,null,"○","卸最新在庫日付参照","◎",null,null,"","","",""]
[null,null,"91",null,"日本語区分（商品名）",null,"X",1,null,null,"該当項目の日本語区分",null,null,null,null,null,"△/0:英数カナ\n1:　　漢字(S-JIS/JIS/JEF/IBM)",null,null,"コード",null,"○","属性初期値","◎",null,null,"","","",""]
[null,null,"92",null,"日本語区分（摘要）",null,"X",1,null,null,"　　〃 ",null,null,null,null,null,"　　〃 ",null,null,"コード",null,"○","属性初期値","◎",null,null,{"$f":"IF($Z106=\"\",\"\",VLOOKUP($Z106,$AF$5:$AM$128,2,))","v":""},"","",""]
[null,null,"93",null,"菓子業界商品分類コード",null,"X",6,null,null,"菓子業界の新商品分類コード",null,"(JICFSの機能分類コードとして登録)",null,null,null,null,null,"桁数",null,null,"○","属性初期値","◎",null,null,"","","",""]
[null,null,"94",null,"明細連携エリア",null,"X",10,null,null,"旧フォーマット予備連携データ",null,"(新フォーマット間：相対利用可能エリア)",null,null,null,null,null,"桁数",null,null,"○","○","◎",null,"53","予備０４","X",3,0]
[null,null,"（次頁に続く）"]
[]
[null,null,"　"]
[]
[null,null,"（前頁の続き）"]
[null,"変更","項番","　項目",null,null,"属性","整数桁","小数桁","必須","　項目説明",null,null,null,null,null,"　コード",null,"アップロード","V２ → Ｖ１･Ｖ２","Ｖ２→ Ｖ１","Ｖ２ ← Ｖ２","Ｖ２ ← Ｖ１","　　　　　　　Ｖ１フォーマット"]
[null,null,null,null,null,null,null,null,null,null,null,null,null,null,null,null,null,null,"チェック","センタチェック","センタチェック","コンバート","コンバート","比較・  変更点",null,"項番","　　項目","属性","整数","小数"]
[null,1.8,"95","レコード件数",null,null,9,6,null,"○","レコードの総件数\n・データ送信側では、自身のフォーマットのレコード件数を設定する。\n・データ受信側では、当項目と実際のレコード件数の整合性チェックには利用しない。※下記【トレーラレコード連携時の留意事項】を参照のこと\n",null,null,null,null,null,null,null,"属性＋桁数","属性",null,"※ センター集計値","　　※ センター集計値",null,null,"54",{"$f":"IF($Z116=\"\",\"\",VLOOKUP($Z116,$AF$5:$AM$128,2,))","v":"レコード件数"},{"$f":"IF($Z116=\"\",\"\",VLOOKUP($Z116,$AF$5:$AM$128,5,))","v":"9"},{"$f":"IF($Z116=\"\",\"\",VLOOKUP($Z116,$AF$5:$AM$128,6,))","v":6},{"$f":"IF($Z116=\"\",\"\",VLOOKUP($Z116,$AF$5:$AM$128,7,))","v":0}]
[null,null,"96","伝票枚数",null,null,9,6,null,null,"伝票枚数",null,null,null,null,null,null,null,"属性＋桁数","属性",null,"※ センター集計値","　　※ センター集計値",null,null,"55","伝票枚数","9",6,0]
[null,null,"97","合計金額符号",null,null,"X",1,null,null,"合計金額の符号",null,null,null,null,null,"△/＋:正数","－:負数","属性","ｺｰﾄﾞ",null,"※ センター設定　 ","　　※ センター設定　 ","○","コード","56","合計金額符号","X",1,0]
[null,null,"98","合計金額",null,null,9,10,null,null,"卸店入金額の全明細行の金額合計",null,null,null,null,null,null,null,"属性＋桁数","属性",null,"※ センター集計値","　　※ センター集計値",null,null,"57","合計金額","9",10,0]
[null,null,"99","連携エリア",null,null,"X",20,null,null,"新フォーマット間：相対利用可能エリア",null,null,null,null,null,null,null,null,null,null,"○","属性初期値","◎",null,null,"","","",""]
[null,1.1000000000000001,"100","一次店カナ名",null,null,"X",30,null,null,"一次店カナ名",null,"(一次店名 に漢字を設定する場合、必須)",null,null,null,null,null,null,null,null,"○","属性初期値","◎",null,null,"","","",""]
[null,1.1000000000000001,"101","二次店カナ名",null,null,"X",30,null,null,"二次店カナ名",null,"(二次店名 に漢字を設定する場合、必須)",null,null,null,null,null,null,null,null,"○","属性初期値","◎",null,null,"","","",""]
[null,1.1000000000000001,"102","届け先カナ名",null,null,"X",30,null,null,"届け先カナ名",null,"(届け先名  に漢字を設定する場合、必須)",null,null,null,null,null,null,null,null,"○","属性初期値","◎",null,null,"","","",""]
[null,1.1000000000000001,"103","摘要カナ",null,null,"X",30,null,null,"摘要カナ",null,"(摘要        に漢字を設定する場合、必須)",null,null,null,null,null,null,null,null,"○","属性初期値","◎",null,null,"","","",""]
[null,1.1000000000000001,"104","商品名カナ",null,null,"X",25,null,null,"商品名カナ",null,"(商品名     に漢字を設定する場合、必須)",null,null,null,null,null,null,null,null,"○","属性初期値","◎",null,null,"","","",""]
[null,null,"105","改行コード",null,null,"X","2",null,null,"S-JISの改行コードを設定",null,null,null,null,null,null,null,null,null,null,null,null,null,null,null,"","","",""]
[null,null,null,null,null,null,null,null,null,null,null,null,null,null,null,null,null,null,null,null,null,"※ 配信分割時"]
[]
[null,null,null,null,null,null,null,null,null,null," ※ファイルの形式は、カンマ区切りの可変長形式となります。各項目の値にダブルクォート「\"」の囲みは不要です。"]
[null,null,null,null,null,null,null,null,null,null," ※画面から受信（ダウンロード）したファイルの最終行にはエンドレコードが出力されます。"]
[null,null,null,null,null,null,null,null,null,null,"　  エンドレコードのレイアウトは「エンドレコード」を参照してください。"]
[null,null,null,null,null,null,null,null,null,null," ※画面から送信（アップロード）するファイルにエンドレコードは不要です。"]

{"sheet":"１３入庫予定","index":9,"n_rows":165,"n_cols":39,"rows_kept":165,"cut":false,"hidden":false,"merged":[[109,1,110,1],[109,2,110,2],[109,3,110,4],[109,6,110,6],[109,7,110,7],[61,23,61,27],[62,23,62,24],[117,16,117,17],[3,23,3,27],[3,35,4,35],[37,31,38,31],[37,32,38,33],[37,35,38,35],[110,23,110,24],[109,23,109,27],[3,31,4,31],[3,32,4,33],[70,16,70,17],[74,16,74,17],[109,16,110,16],[3,38,4,38],[3,16,4,16],[37,36,38,36],[37,37,38,37],[37,38,38,38],[3,36,4,36],[3,37,4,37],[4,23,4,24],[3,1,4,1],[61,1,62,1],[61,2,62,2],[61,3,62,4],[61,6,62,6],[3,3,4,4],[3,6,4,6],[3,2,4,2],[61,7,62,7],[61,8,62,8],[3,10,4,10],[148,10,148,15],[123,16,123,17],[3,9,4,9],[3,8,4,8],[61,16,62,16],[3,7,4,7],[85,16,85,17],[61,9,62,9],[109,8,110,8],[109,9,110,9],[109,10,110,10],[61,10,62,10]]}
[null,null,null,null,null,null,null,null,null,null,null,null,null,null,null,null,null,null,null,null,null,null,null,null,null,null,null,null,null,null,null,{"$f":"シート別総ページ数","v":{"$error":"#NAME?"}}]
[null,null,"（２） Ｖ２・１３入庫予定",null,null,null,null,null,null,null,null,null,null,null,null,null,null,null,null,null,null,null,null,null,null,null,null,null,null,null,null,"（２） Ｖ１・１１入庫予定"]
[null,null,"　"]
[null,"変更","項番","　項目",null,null,"属性","整数桁","小数桁","必須","　項目説明",null,null,null,null,null,"　コード",null,"アップロード","V２ → Ｖ１･Ｖ２","Ｖ２→ Ｖ１","Ｖ２ ← Ｖ２","Ｖ２ ← Ｖ１","　　　　　　　Ｖ１フォーマット",null,null,null,null,null,null,null,"項番","　項目",null,null,"属性","整数桁","小数桁","必須"]
[null,null,null,null,null,null,null,null,null,null,null,null,null,null,null,null,null,null,"チェック","センタチェック","センタチェック","コンバート","コンバート","比較・  変更点",null,"項番","　　項目","属性","整数","小数"]
[null,null,"1","データ種別",null,null,9,2,null,"◎","１３：入庫予定データ",null,null,null,null,null,"13",null,"必須","ｺｰﾄﾞ",null,"○","\"13\"固定","○","ｺｰﾄﾞ",null,{"$f":"IF($Z6=\"\",\"\",VLOOKUP($Z6,$AF$6:$AM$17,2,))","v":""},{"$f":"IF($Z6=\"\",\"\",VLOOKUP($Z6,$AF$6:$AM$17,6,))","v":""},{"$f":"IF($Z6=\"\",\"\",VLOOKUP($Z6,$AF$6:$AM$17,7,))","v":""},{"$f":"IF($Z6=\"\",\"\",VLOOKUP($Z6,$AF$6:$AM$17,8,))","v":""},null,"1","データ種別",null,null,"9",2,null,"◎"]
[null,null,"2","最終トレーラ判定区分",null,null,"X",1,null,"◎","トレーラ判定の区分",null,null,null,null,null,"9:最終","△:それ以外",null,"ｺｰﾄﾞ",null,"○","○",null,null,"2",{"$f":"IF($Z7=\"\",\"\",VLOOKUP($Z7,$AF$6:$AM$73,2,))","v":"最終トレーラ判定区分"},{"$f":"IF($Z7=\"\",\"\",VLOOKUP($Z7,$AF$6:$AM$73,5,))","v":"X"},{"$f":"IF($Z7=\"\",\"\",VLOOKUP($Z7,$AF$6:$AM$73,6,))","v":1},{"$f":"IF($Z7=\"\",\"\",VLOOKUP($Z7,$AF$6:$AM$73,7,))","v":0},null,"2","最終トレーラ判定区分",null,null,"X",1,null,"◎"]
[null,null,"3","送信先コード",null,null,9,8,null,"◎","送信先(卸)","の統一取引先コード",null,null,null,null,null,null,"必須＋属性＋桁数＋登録","センター登録",null,"○","○",null,null,"3",{"$f":"IF($Z8=\"\",\"\",VLOOKUP($Z8,$AF$6:$AM$73,2,))","v":"送信先コード"},{"$f":"IF($Z8=\"\",\"\",VLOOKUP($Z8,$AF$6:$AM$73,5,))","v":"9"},{"$f":"IF($Z8=\"\",\"\",VLOOKUP($Z8,$AF$6:$AM$73,6,))","v":8},{"$f":"IF($Z8=\"\",\"\",VLOOKUP($Z8,$AF$6:$AM$73,7,))","v":0},null,"3","送信先コード",null,null,"9",8,null,"◎"]
[null,null,"4","送信元コード",null,null,9,8,null,"◎","送信元(メーカ)","の統一取引先コード",null,null,null,null,null,null,"必須＋属性＋桁数＋登録","センター登録",null,"○","○",null,null,"4","送信元コード","9",8,0,null,"4","送信元コード",null,null,"9",8,null,"◎"]
[null,null,"5","データ作成日",null,null,9,8,null,"◎","データ作成日付",null,"(西暦 YYYYMMDD)",null,null,null,null,null,null,"必須＋日付","センタチェック","○","○",null,null,"5","データ作成日","9",8,0,null,"5","データ作成日",null,null,"9",8,null,"○"]
[null,null,"6","データ作成時刻",null,null,9,6,null,null,"データ作成時刻",null,"(HHMMSS)",null,null,null,null,null,null,"時刻","と同じ","○","属性初期値","◎",null,null,"","","","",null,"6","送信先名",null,null,"X",20,null,"○"]
[null,null,"7","送信先名",null,null,"X",20,null,"○","送信元(卸)名 　          　",null,"(英数カナのみ)",null,null,null,null,null,"属性",null,null,"○","○",null,null,"6","送信先名","X",20,0,null,"7","送信元名",null,null,"X",20,null,"○"]
[null,null,"8","送信元名",null,null,"X",20,null,"◎","送信先(メーカ)名          ",null,"(英数カナのみ)",null,null,null,null,null,"属性","必須",null,"○","○",null,null,"7","送信元名","X",20,0,null,"8","直接送信先コード",null,null,"9",8]
[null,null,"9","直接送信先コード",null,null,9,8,null,null,"送信先コードと異なる場合にセット          ",null,"(通常はゼロ)",null,null,null,null,null,null,"センター登録",null,"○","○",null,null,"8","直接送信先コード","9",8,0,null,"9","直接送信先カナ名",null,null,"X",20]
[null,null,"10","直接送信先名",null,null,"X",20,null,null,"直接送信先名",null,"(英数カナのみ、通常はスペース)",null,null,null,null,null,"属性",null,null,"○","○",null,null,"9","直接送信先カナ名","X",20,0,null,"10","予備０１",null,null,"X",161]
[null,null,"11","送信ファイルNO",null,null,9,2,null,null,"同時送信時の問合せ№",null,"(00～99)",null,null,null,null,null,null,"属性",null,"○","属性初期値","◎",null,null,"","","","",null,"11","卸伝票NO",null,null,"9",6,null,"○"]
[null,null,"12","連携エリア",null,null,"X",20,null,null,"新フォーマット間：相対利用可能エリア",null,null,null,null,null,null,null,null,null,null,"○","属性初期値","◎",null,null,"","","","",null,"12","メーカ伝票NO",null,null,"9",6]
[null,null,"13","卸発注伝票NO",null,null,9,8,null,"○","受発注データの卸伝票№",null,"(6桁→8桁に拡張、6桁運用の時は上２桁ゼロ埋め）",null,null,null,null,null,"属性＋桁数","属性",null,"○","予備上2桁(不正時\"00\")\n＋卸伝票NO","○","桁数","27\n11","予備０２\n卸伝票NO","X\n9","100\n６",0,null,"13","元伝NO",null,null,"9",6]
[null,null,"14","メーカ伝票NO",null,null,9,8,null,null,"メーカ発行伝票№",null,"(6桁→8桁に拡張、6桁運用の時は上２桁ゼロ埋め）",null,null,null,null,null,null,"属性",null,"○","○","○","桁数","12",{"$f":"IF($Z19=\"\",\"\",VLOOKUP($Z19,$AF$6:$AM$73,2,))","v":"メーカ伝票NO"},{"$f":"IF($Z19=\"\",\"\",VLOOKUP($Z19,$AF$6:$AM$73,5,))","v":"9"},{"$f":"IF($Z19=\"\",\"\",VLOOKUP($Z19,$AF$6:$AM$73,6,))","v":6},{"$f":"IF($Z19=\"\",\"\",VLOOKUP($Z19,$AF$6:$AM$73,7,))","v":0},null,"14","取引コード",null,null,"9",2,null,"○"]
[null,null,"15","店入直送区分",null,null,9,1,null,"◎","店(倉)入れまたは直送等の区分",null,null,null,null,null,"1:店入\n(2:直送)\n","(3:店引取)\n(4:直送引取)",null,"必須＋ｺｰﾄﾞ",null,"○","\"1\"固定","◎",null,null,"","","","",null,"15","納品日",null,null,"9",8,null,"○"]
[null,2.7,"16","取引コード",null,null,9,2,null,"◎","業界統一取引コード",null,null,null,null,null,"11:店入売上\n12:店入売上訂正\n21:店入返品\n22:店入返品訂正\n31:直送売上\n32:直送売上訂正\n\n\n\n","41:直送返品\n42:直送返品訂正\n51:割戻し金\n52:相殺\n81:ﾒｰｶｰ提供の役務\n91:卸提供の役務",null,"必須＋ｺｰﾄﾞ",null,"○","○",null,null,"14","取引コード","9",2,0,null,"16","出荷日",null,null,"9",8,null,"○"]
[null,null,"17","納品日",null,null,9,8,null,"○","発注伝票の納品日",null,"(西暦 YYYYMMDD)",null,null,null,null,null,"属性＋桁数","日付",null,"○","○",null,null,"15","納品日","9",8,0,null,"17","着荷日",null,null,"9",8,null,"○"]
[null,null,"18","出荷日",null,null,9,8,null,"○","実出荷日",null,"(西暦 YYYYMMDD)",null,null,null,null,null,"属性＋桁数","日付",null,"○","○",null,null,"16","出荷日","9",8,0,null,"18","納入時間",null,null,"9",4]
[null,null,"19","着荷日",null,null,9,8,null,"○","納品予定日",null,"(西暦 YYYYMMDD)",null,null,null,null,null,"属性＋桁数","日付",null,"○","○",null,null,"17","着荷日","9",8,0,null,"19","明細行数",null,null,"9",2,null,"○"]
[null,null,"20","納入予定時間",null,null,9,4,null,null,"納入予定時間",null,"(HHMM)",null,null,null,null,null,null,"時刻",null,"○","○","○","名称","18","納入時間","9",4,0,null,"20","届け先コード",null,null,"9",8,null,"○"]
[null,null,"21","倉庫コード",null,null,"X",4,null,null,"メーカの出荷倉庫を識別",null,"(相対協議)",null,null,null,null,null,null,null,null,"○","属性初期値","◎",null,null,"","","","",null,"21","届け先カナ名",null,null,"X",30,null,"○"]
[null,null,"22","伝送区分",null,null,"X",1,null,null,null,null,"(未使用)",null,null,null,null,null,null,null,null,"○","属性初期値","◎",null,null,"","","","",null,"22","伝票合計金額符号",null,null,"X",1,null,"○"]
[null,null,"23","出荷報告以外区分",null,null,"X",1,null,null,null,null,"(未使用)",null,null,null,null,null,null,null,null,"○","属性初期値","◎",null,null,"","","","",null,"23","伝票合計金額",null,null,"9",8,null,"○"]
[null,null,"24","集計明細区分",null,null,"X",1,null,null,null,null,"(未使用)",null,null,null,null,null,null,null,null,"○","属性初期値","◎",null,null,"","","","",null,"24","定番特売区分",null,null,"X",1,null,"○"]
[null,null,"25","請求締日",null,null,9,8,null,null,null,null,"(未使用)",null,null,null,null,null,null,null,null,"○","属性初期値","◎",null,null,"","","","",null,"25","摘要欄０１",null,null,"X",30]
[null,null,"26","請求口座",null,null,"X",10,null,null,null,null,"(未使用)",null,null,null,null,null,null,null,null,"○","属性初期値","◎",null,null,"","","","",null,"26","メーカコード",null,null,"X",9,null,"○"]
[null,null,"27","請求支払区分",null,null,9,2,null,null,null,null,"(未使用)",null,null,null,null,null,null,null,null,"○","属性初期値","◎",null,null,"","","","",null,"27","予備０２",null,null,"X",100]
[null,null,"28","明細行数",null,null,9,2,null,"○","伝票内明細数",null,null,null,null,null,"00～06",null,null,"ｺｰﾄﾞ",null,"○","○",null,null,"19","明細行数","9",2,0]
[null,null,"29","一次店コード",null,null,"X",13,null,"◎","統一取引先コード(8桁)",null,null,null,"(後方スペース埋め)",null,null,null,"桁数","必須",null,"○","届け先コード\n前詰８桁＋空白５桁","◎",null,null,"","","",""]
[null,null,"30","二次店コード",null,null,"X",13,null,null,"統一取引先コード(8桁)／プライベート・コード(3～8桁)／ＧＬＮ(13桁)",null,null,null,"(後方スペース埋め)",null,null,null,"桁数",null,null,"○","属性初期値","◎",null,null,"","","",""]
[null,null,"31","三次店コード",null,null,"X",13,null,null,"統一取引先コード(8桁)／プライベート・コード(3～8桁)／ＧＬＮ(13桁)",null,null,null,"(後方スペース埋め)",null,null,null,"桁数",null,null,"○","属性初期値","◎",null,null,"","","",""]
[null,null,"32","届け先コード",null,null,"X",13,null,"○","統一取引先コード(8桁)／プライベート・コード(3～8桁)／ＧＬＮ(13桁)",null,null,null,"(後方スペース埋め)",null,null,null,"桁数",null,null,"○","前詰８桁＋空白５桁","○","属性＋桁数","20","届け先コード","9",8,0]
[null,null,"33","チェーン店コード",null,null,"X",13,null,null,"統一取引先コード(8桁)／プライベート・コード(3～8桁)／ＧＬＮ(13桁)",null,null,null,"(後方スペース埋め)",null,null,null,"桁数",null,null,"○","属性初期値","◎",null,null,"","","","",null,"項番","　項目",null,null,"属性","整数桁","小数桁","必須"]
[null,null,"34","専用伝票日付",null,null,9,8,null,null,null,null,"(未使用)",null,null,null,null,null,null,null,null,"○","属性初期値","◎",null,null,"","","",""]
[null,null,"35","専用伝票NO",null,null,9,9,null,null,null,null,"(未使用)",null,null,null,null,null,null,null,null,"○","属性初期値","◎",null,null,"","","","",null,null,"明細部　　　　　　　　　　　　　　　　　　　　　　　　　　　　　　　　　　　　　　　　"]
[null,null,"36","元伝年月日",null,null,9,8,null,null,null,null,"(未使用)",null,null,null,null,null,null,null,null,"○","属性初期値","◎",null,null,"","","","",null,"28",null,"行NO",null,"9",2,null,"○"]
[null,null,"37","元伝NO",null,null,9,8,null,null,null,null,"(未使用)",null,null,null,null,null,null,null,null,"○","○","○","桁数","13","元伝NO","9",6,0,null,"29",null,"商品コード識別区分",null,"X",1,null,"○"]
[null,null,"38","伝票合計金額符号",null,null,"X",1,null,"○","伝票の合計金額の符号",null,null,null,null,null,"△/＋:正数","－:負数","属性","ｺｰﾄﾞ",null,"○","○","○","ｺｰﾄﾞ","22","伝票合計金額符号","X",1,0,null,"30",null,"品番",null,"X",16,null,"○"]
[null,null,"39","伝票合計金額",null,null,9,8,null,"○","伝票の合計金額",null,"(卸店入価格、１億円未満)",null,null,null,null,null,"属性＋桁数","属性",null,"○","○",null,null,"23","伝票合計金額","9",8,0,null,"31",null,"商品名",null,"X",25,null,"○"]
[null,null,"40","二次店納入合計金額符号",null,null,"X",1,null,null,"正味納入合計金額の符号",null,null,null,null,null,"△/＋:正数","－:負数","属性","ｺｰﾄﾞ",null,"○","属性初期値","◎",null,null,"","","","",null,"32",null,"包装区分",null,"9",1,null,"○"]
[null,null,"41","二次店納入合計金額",null,null,9,8,null,null,"正味納入合計金額",null,"(二次店納入価格、１億円未満）",null,null,null,null,null,"属性＋桁数","属性",null,"○","属性初期値","◎",null,null,"","","","",null,"33",null,"内容","ボール内バラ数","9",4,2,"○"]
[null,null,"42","一次店名",null,null,"X/N",40,null,null,"一次店名",null,"(英数カナは30文字、漢字は20文字)",null,null,null,null,null,null,null,null,"○","属性初期値","◎",null,null,"","","","",null,"34",null,null,"ケース内ボール数","9",2,null,"○"]
[null,null,"43","二次店名",null,null,"X/N",40,null,null,"二次店名",null,"(英数カナは30文字、漢字は20文字)",null,null,null,null,null,null,null,null,"○","属性初期値","◎",null,null,"","","","",null,"35",null,"数量符号",null,"X",1,null,"○"]
[null,null,"44","三次店名",null,null,"X/N",40,null,null,"三次店名",null,"(英数カナは30文字、漢字は20文字)",null,null,null,null,null,null,null,null,"○","属性初期値","◎",null,null,"","","","",null,"36",null,"数量","ケース数量","9",7,null,"○"]
[null,null,"45","届け先名",null,null,"X/N",40,null,"○","届け先名",null,"(英数カナは30文字、漢字は20文字)",null,null,null,null,null,null,null,null,"○","○","○","属性＋桁数","21","届け先カナ名","X",30,0,null,"37",null,null,"ボール数量","9",7,null,"○"]
[null,null,"46","チェーン店名",null,null,"X/N",40,null,null,"チェーン店名",null,"(英数カナは30文字、漢字は20文字)",null,null,null,null,null,null,null,null,"○","属性初期値","◎",null,null,"","","","",null,"38",null,null,"バラ数量","9",7,2,"○"]
[null,null,"47","電話番号",null,null,"X",15,null,null,"通常は届け先の電話番号  ",null,"(局番区切り(-)あり)",null,null,null,null,null,null,null,null,"○","属性初期値","◎",null,null,"","","","",null,"39",null,"単価","卸店入価格","9",6,2,"○"]
[null,null,"48","住所",null,null,"X/N",80,null,null,"通常は届け先の住所         ",null,"(英数カナは60文字、漢字は40文字)",null,null,null,null,null,null,null,null,"○","属性初期値","◎",null,null,"","","","",null,"40",null,null,"二次店納入価格","9",6,2]
[null,null,"49","摘要",null,null,"X/N",50,null,null,"伝票の摘要欄の内容",null,"(英数カナは50文字、漢字は25文字）",null,null,null,null,null,null,null,null,"○","○","○","属性＋桁数","25","摘要欄０１","X",30,0,null,"41",null,"金額符号",null,"X",1,null,"○"]
[null,null,"50","メーカコード",null,null,"X",9,null,"○","７桁の場合は後ろスペース",null,"(49xxxxx / 45xxxxxxx)",null,null,null,null,null,"属性",null,null,"○","○",null,null,"26","メーカコード","X",9,0,null,"42",null,"金額","卸店入金額","9",8,null,"○"]
[null,null,"51","メーカ所属組織名",null,null,"X",10,null,null,null,null,"(未使用)",null,null,null,null,null,null,null,null,"○","属性初期値","◎",null,null,"","","","",null,"43",null,null,"二次店納入金額","9",8]
[null,null,"（次頁に続く）",null,null,null,null,null,null,null,null,null,null,null,null,null,null,null,null,null,null,null,null,null,null,null,null,null,null,null,null,"44",null,"欠品区分",null,"9",1,null,"○"]
[null,null,null,null,null,null,null,null,null,null,null,null,null,null,null,null,null,null,null,null,null,null,null,null,null,null,null,null,null,null,null,"45",null,"商品添付区分",null,"X",1,null,"○"]
[null,null,"　",null,null,null,null,null,null,null,null,null,null,null,null,null,null,null,null,null,null,null,null,null,null,null,null,null,null,null,null,"46",null,"賞味期限製造年月日",null,"X",6]
[null,null,null,null,null,null,null,null,null,null,null,null,null,null,null,null,null,null,null,null,null,null,null,null,null,null,null,null,null,null,null,"47","予備０３",null,null,"X",1]
[null,null,"（前頁の続き）",null,null,null,null,null,null,null,null,null,null,null,null,null,null,null,null,null,null,null,null,null,null,null,null,null,null,null,null,"48","レコード件数",null,null,"9",6,null,"○"]
[null,"変更","項番","　項目",null,null,"属性","整数桁","小数桁","必須","　項目説明",null,null,null,null,null,"　コード",null,"アップロード","V２ → Ｖ１･Ｖ２","Ｖ２→ Ｖ１","Ｖ２ ← Ｖ２","Ｖ２ ← Ｖ１","　　　　　　　Ｖ１フォーマット",null,null,null,null,null,null,null,"49","伝票枚数",null,null,"9",6]
[null,null,null,null,null,null,null,null,null,null,null,null,null,null,null,null,null,null,"チェック","センタチェック","センタチェック","コンバート","コンバート","比較・  変更点",null,"項番","　　項目","属性","整数","小数",null,"50","合計金額符号",null,null,"X",1]
[null,null,"52","伝票区分",null,null,9,1,null,null,null,null,"(未使用)",null,null,null,null,null,null,null,null,"○","属性初期値","◎",null,null,{"$f":"IF($Z64=\"\",\"\",VLOOKUP($Z64,$AF$6:$AM$73,2,))","v":""},{"$f":"IF($Z64=\"\",\"\",VLOOKUP($Z64,$AF$6:$AM$73,5,))","v":""},{"$f":"IF($Z64=\"\",\"\",VLOOKUP($Z64,$AF$6:$AM$73,6,))","v":""},{"$f":"IF($Z64=\"\",\"\",VLOOKUP($Z64,$AF$6:$AM$73,7,))","v":""},null,"51","合計金額",null,null,"9",10]
[null,null,"53","登録店区分",null,null,"X",1,null,null,null,null,"(未使用)",null,null,null,null,null,null,null,null,"○","属性初期値","◎",null,null,"","","","",null,"52","予備",null,null,"X",214]
[null,null,"54","定番特売区分",null,null,"X",1,null,"○","定番発注/特売発注の区分",null,null,null,null,null,"0:定番\n1:特売\n","△:分類不能","属性","ｺｰﾄﾞ",null,"○","\"0\"・\"1\"以外 → \"△\"","○","ｺｰﾄﾞ","24","定番特売区分","X",1,0,null,"53","一次店漢字名",null,null,"X",60]
[null,null,"55","消費税区分",null,null,"X",1,null,null,"税区分",null,null,null,null,null,"1:外税\n2:内税\n","3:非課税\n△:個別判断",null,"ｺｰﾄﾞ",null,"○","属性初期値","◎",null,null,"","","","",null,"54","二次店漢字名",null,null,"X",60]
[null,null,"56","消費税率",null,null,9,2,1,null,"消費税の税率(99.9％)、ゼロ:個別判断　",null,null,"(小数点以下1桁)",null,null,null,null,"属性＋桁数","属性",null,"○","属性初期値","◎",null,null,"","","","",null,"55","届け先漢字名",null,null,"X",60]
[null,null,"57","ロット不足運賃負担区分",null,null,"X",1,null,null,"発注ロット不足になった場合の運賃負担の区分",null,null,null,null,null,"△:無指定\n1:卸負担\n","2:負担なし",null,"ｺｰﾄﾞ",null,"○","属性初期値","◎",null,null,"","","","",null,"56","摘要欄０２",null,null,"X",50]
[null,null,"58","取引先区分（一次店）",null,null,"X",1,null,null,"該当項目の取引先の属性区分",null,null,null,null,null,"△:統一取引先(8桁)",null,null,"ｺｰﾄﾞ",null,"○","属性初期値","◎",null,null,"","","","",null,"57","予備０５",null,null,"X",7]
[null,null,"59","取引先区分（二次店）",null,null,"X",1,null,null,"　　〃 ",null,null,null,null,null,"△:  統一取引先(8桁)\n6:   GLN(13桁)\n7/8:プライベートコード(卸/ﾒｰｶ)",null,null,"ｺｰﾄﾞ",null,"○","属性初期値","◎",null,null,"","","","",null,"58","改行コード",null,null,"X","2"]
[null,null,"60","取引先区分（三次店）",null,null,"X",1,null,null,"　　〃 ",null,null,null,null,null,"　　〃 ",null,null,"ｺｰﾄﾞ",null,"○","属性初期値","◎",null,null,"","","",""]
[null,1.3,"61","取引先区分（届け先）",null,null,"X",1,null,null,"　　〃 ",null,null,null,null,null,"　　〃 ",null,null,"ｺｰﾄﾞ",null,"○","属性初期値","◎",null,null,"","","",""]
[null,null,"62","取引先区分（チェーン店）",null,null,"X",1,null,null,"　　〃 ",null,null,null,null,null,"　　〃 ",null,null,"ｺｰﾄﾞ",null,"○","属性初期値","◎",null,null,"","","",""]
[null,null,"63","日本語区分（一次店）",null,null,"X",1,null,null,"該当項目の日本語区分",null,null,null,null,null,"△/0:英数カナ\n1:　　漢字(S-JIS/JIS/JEF/IBM)",null,null,"ｺｰﾄﾞ",null,"○","属性初期値","◎",null,null,"","","",""]
[null,null,"64","日本語区分（二次店）",null,null,"X",1,null,null,"　　〃 ",null,null,null,null,null,"　　〃 ",null,null,"ｺｰﾄﾞ",null,"○","属性初期値","◎",null,null,"","","",""]
[null,null,"65","日本語区分（三次店）",null,null,"X",1,null,null,"　　〃 ",null,null,null,null,null,"　　〃 ",null,null,"ｺｰﾄﾞ",null,"○","属性初期値","◎",null,null,"","","",""]
[null,null,"66","日本語区分（届け先）",null,null,"X",1,null,null,"　　〃 ",null,null,null,null,null,"　　〃 ",null,null,"ｺｰﾄﾞ",null,"○","属性初期値","◎",null,null,"","","",""]
[null,null,"67","日本語区分（チェーン店）",null,null,"X",1,null,null,"　　〃 ",null,null,null,null,null,"　　〃 ",null,null,"ｺｰﾄﾞ",null,"○","属性初期値","◎",null,null,"","","",""]
[null,null,"68","日本語区分（住所）",null,null,"X",1,null,null,"　　〃 ",null,null,null,null,null,"　　〃 ",null,null,"ｺｰﾄﾞ",null,"○","属性初期値","◎",null,null,"","","",""]
[null,null,"69","日本語区分（摘要）",null,null,"X",1,null,null,"　　〃 ",null,null,null,null,null,"　　〃 ",null,null,"ｺｰﾄﾞ",null,"○","属性初期値","◎",null,null,"","","",""]
[null,null,"70","ヘッダー連携エリア",null,null,"X",20,null,null,"新フォーマット間：相対利用可能エリア",null,null,null,null,null,null,null,null,null,null,"○","属性初期値","◎",null,null,"","","",""]
[null,null,null,"明細部　　　　　　　　　　　　　　　　　　　　　　　　　　　　　　　　　　　　　　　　",null,null,null,null,null,null,null,null,null,null,null,null,null,null,null,null,null,null,null,null,null,null,"","","",""]
[null,null,"71",null,"明細行NO",null,9,2,null,"◎","伝票内明細数",null,null,null,null,null,"01～06",null,null,"必須＋ｺｰﾄﾞ",null,"○","6行変換設定","○","名称","28",{"$f":"IF($Z84=\"\",\"\",VLOOKUP($Z84,$AF$6:$AM$73,3,))","v":"行NO"},"9",2,0]
[null,null,"72",null,"専用伝票行NO",null,9,2,null,null,"専用伝票の行№",null,"(00～99)",null,null,null,null,null,null,"属性",null,"○","属性初期値","◎",null,null,"","","",""]
[null,null,"73",null,"商品コード識別区分",null,9,1,null,"○","品番(商品コード)の識別区分",null,null,null,null,null,"0:統一商品コード\n1:ＩＴＦコード (14桁)\n2:ＩＴＦコード(16桁)  【利用停止化】\n3:JANコード    (標準:13桁)\n4:JANコード    (短縮:8桁)\n6:GTINコード  (14桁)",null,"属性","コード(新)",null,"○","○","○","属性＋コード\n2:利用停止","29","商品コード識別区分","X",1,0]
[null,null,"74",null,"品番",null,"X",16,null,"○","統一商品ｺｰﾄﾞ､ITFｺｰﾄﾞ､JANｺｰﾄﾞ､GTINｺｰﾄﾞ",null,null,"(左詰め)",null,null,null,null,"属性",null,null,"○","○","○","ITF(16)\n利用停止","30","品番","X",16,0]
[null,null,"75",null,"商品名",null,"X/N",40,null,"○","商品名",null,"(英数カナは25文字、漢字は20文字)",null,null,null,null,null,null,null,null,"○","○","○","属性＋桁数","31","商品名","X",25,0]
[null,null,"76",null,"包装区分",null,9,1,null,"◎","数量の発注単位の区分",null,"(1:ケース発注時)","(2:ボール発注時)","(3:バラ発注時)",null,"1:ケース発注\n2:ボール発注\n","3:バラ発注",null,"必須＋ｺｰﾄﾞ",null,"○","不正コード値 → \"1\"　",null,null,"32","包装区分","9",1,0]
[null,null,"77",null,"内容","ボール内バラ数",9,4,2,"○","包装区分に準じた設定",null,"(ボール内バラ数","/ボール内バラ数","/ゼロ)",null,null,null,"属性＋桁数","属性",null,"○","○",null,null,"33",{"$f":"IF($Z90=\"\",\"\",VLOOKUP($Z90,$AF$6:$AM$73,4,))","v":"ボール内バラ数"},"9",4,2]
[null,null,"78",null,null,"ケース内ボール数",9,2,null,"○","包装区分に準じた設定",null,"(ケース内ボール数","/ゼロ","/ゼロ)",null,null,null,"属性＋桁数","属性",null,"○","○",null,null,"34",{"$f":"IF($Z91=\"\",\"\",VLOOKUP($Z91,$AF$6:$AM$73,4,))","v":"ケース内ボール数"},"9",2,0]
[null,null,"79",null,"数量符号",null,"X",1,null,"○","数量の符号",null,null,null,null,null,"△/＋:正数","－:負数","属性","ｺｰﾄﾞ",null,"○","○","○","コード\n2:利用停止","35",{"$f":"IF($Z92=\"\",\"\",VLOOKUP($Z92,$AF$6:$AM$73,3,))","v":"数量符号"},"X",1,0]
[null,null,"80",null,"数量","ケース数量",9,7,null,"○","包装区分に準じた設定",null,"(ケース数量","/ゼロ","/ゼロ)",null,null,null,"属性＋桁数","属性",null,"○","○",null,null,"36",{"$f":"IF($Z93=\"\",\"\",VLOOKUP($Z93,$AF$6:$AM$73,4,))","v":"ケース数量"},"9",7,0]
[null,null,"81",null,null,"ボール数量",9,7,null,"○","包装区分に準じた設定",null,"(ゼロ","/ボール数量","/ゼロ)",null,null,null,"属性＋桁数","属性",null,"○","○",null,null,"37","ボール数量","9",7,0]
[null,null,"82",null,null,"バラ数量",9,7,2,"○","包装区分に準じた設定",null,"(バラ数量","/バラ数量","バラ数量)",null,null,null,"属性＋桁数","属性",null,"○","○",null,null,"38","バラ数量","9",7,2]
[null,null,"83",null,"単価","卸店入価格",9,6,2,"○","卸店入価格",null,"(バラ単価)",null,null,null,null,null,"属性＋桁数","属性",null,"○","○",null,null,"39","卸店入価格","9",6,2]
[null,null,"84",null,null,"二次店納入価格",9,6,2,null,"二次卸店等への納入価格",null,"(バラ単価)",null,null,null,null,null,"属性＋桁数","属性",null,"○","○",null,null,"40","二次店納入価格","9",6,2]
[null,null,"85",null,"金額符号",null,"X",1,null,"○","金額の符号",null,null,null,null,null,"△/＋:正数","－:負数","属性","ｺｰﾄﾞ",null,"○","○","○","コード\n2:利用停止","41",{"$f":"IF($Z98=\"\",\"\",VLOOKUP($Z98,$AF$6:$AM$73,3,))","v":"金額符号"},"X",1,0]
[null,null,"86",null,"金額","卸店入金額",9,8,null,"○","卸店入金額",null,null,null,null,null,null,null,"属性＋桁数","属性",null,"○","○",null,null,"42",{"$f":"IF($Z99=\"\",\"\",VLOOKUP($Z99,$AF$6:$AM$73,4,))","v":"卸店入金額"},"9",8,0]
[null,null,"87",null,null,"二次店納入金額",9,8,null,null,"二次卸店等への納入金額",null,null,null,null,null,null,null,"属性＋桁数","属性",null,"○","○",null,null,"43","二次店納入金額","9",8,0]
[null,null,"88",null,"商品添付区分",null,"X",1,null,"○","添付商品扱いの区分",null,"(相対運用)",null,null,null,"△:売上げ\n1:現物添付","2:見本\n3:景品","属性","ｺｰﾄﾞ(新)",null,"○","\"0\" → \"△\"",null,null,"45",{"$f":"IF($Z101=\"\",\"\",VLOOKUP($Z101,$AF$6:$AM$73,3,))","v":"商品添付区分"},"X",1,0]
[null,null,"89",null,"欠品区分",null,9,2,null,"○","商品の出荷状況を指定",null,null,null,null,null,"00:正常\n01:品切れ\n02:終売","03:未発売\n04:コード訂正\n",null,"ｺｰﾄﾞ(新)",null,"○","\"△\" → \"00\"、\nその他、前ｾﾞﾛ埋め","○","桁数","44",{"$f":"IF($Z102=\"\",\"\",VLOOKUP($Z102,$AF$6:$AM$73,3,))","v":"欠品区分"},"9",1,0]
[null,null,"90",null,"入荷単位ケース数",null,9,2,null,null,"荷合せ品の場合の１梱包ケース数量を指定する",null,null,null,null,null,"00～20",null,"属性＋桁数","ｺｰﾄﾞ",null,"○","属性初期値","◎",null,null,{"$f":"IF($Z103=\"\",\"\",VLOOKUP($Z103,$AF$6:$AM$73,2,))","v":""},"","",""]
[null,null,"91",null,"単価計算区分",null,"X",1,null,null,"単価×数量の計算方法を指定する",null,"(小数点以下端数の計算処置方法)",null,null,null,"△:切捨て\n1:切上げ","2:四捨五入",null,"ｺｰﾄﾞ",null,"○","属性初期値","◎",null,null,{"$f":"IF($Z104=\"\",\"\",VLOOKUP($Z104,$AF$6:$AM$73,2,))","v":""},"","",""]
[null,null,"（次頁に続く）"]
[]
[null,null,"　"]
[]
[null,null,"（前頁の続き）"]
[null,"変更","項番","　項目",null,null,"属性","整数桁","小数桁","必須","　項目説明",null,null,null,null,null,"　コード",null,"アップロード","V２ → Ｖ１･Ｖ２","Ｖ２→ Ｖ１","Ｖ２ ← Ｖ２","Ｖ２ ← Ｖ１","　　　　　　　Ｖ１フォーマット"]
[null,null,null,null,null,null,null,null,null,null,null,null,null,null,null,null,null,null,"チェック","センタチェック","センタチェック","コンバート","コンバート","比較・  変更点",null,"項番","　　項目","属性","整数","小数"]
[null,null,"92",null,"卸発注行番号",null,9,2,null,null,"卸売業での発注伝票行NO",null,"(00～99)",null,null,null,null,null,null,"属性",null,"○","属性初期値","◎",null,null,{"$f":"IF($Z112=\"\",\"\",VLOOKUP($Z112,$AF$6:$AM$73,2,))","v":""},{"$f":"IF($Z112=\"\",\"\",VLOOKUP($Z112,$AF$6:$AM$73,5,))","v":""},{"$f":"IF($Z112=\"\",\"\",VLOOKUP($Z112,$AF$6:$AM$73,6,))","v":""},{"$f":"IF($Z112=\"\",\"\",VLOOKUP($Z112,$AF$6:$AM$73,7,))","v":""}]
[null,null,"93",null,"卸最新在庫日付区分",null,"X",1,null,null,"卸最新在庫日付の日付区分",null,null,null,null,null,"△:未使用\n1:製造日\n","2:賞味期限",null,"ｺｰﾄﾞ",null,"○","属性初期値","◎",null,null,{"$f":"IF($Z113=\"\",\"\",VLOOKUP($Z113,$AF$6:$AM$73,2,))","v":""},"","",""]
[null,1.9,"94",null,"卸最新在庫日付",null,9,8,null,null,"賞味期限／製造日(YYYYMMDD) ",null,"(賞味年月表示は月末最終日）",null,null,null,null,null,"属性＋桁数","日付",null,"○","属性初期値","◎",null,null,{"$f":"IF($Z114=\"\",\"\",VLOOKUP($Z114,$AF$6:$AM$73,2,))","v":""},"","",""]
[null,null,"95",null,"入庫許容日付区分",null,"X",1,null,null,"入庫許容日付の日付区分",null,null,null,null,null,"△:未使用\n1:製造日\n","2:賞味期限",null,"ｺｰﾄﾞ",null,"○","属性初期値","◎",null,null,{"$f":"IF($Z115=\"\",\"\",VLOOKUP($Z115,$AF$6:$AM$73,2,))","v":""},"","",""]
[null,null,"96",null,"入庫許容日付",null,9,8,null,null,"賞味期限／製造日(YYYYMMDD) ",null,"(賞味年月表示は月末最終日）",null,null,null,null,null,"属性＋桁数","日付",null,"○","属性初期値","◎",null,null,"","","",""]
[null,null,"97",null,"実入庫製品日付区分",null,"X",1,null,null,"実入庫製品日付の日付区分",null,null,null,null,null,"△:未使用\n1:製造日\n","2:賞味期限",null,"ｺｰﾄﾞ",null,"○","属性初期値","◎",null,null,"","","",""]
[null,1.9,"98",null,"実入庫製品日付",null,9,8,null,null,"賞味期限／製造日(YYYYMMDD) ",null,"(賞味年月表示は月末最終日）",null,null,null,null,null,"属性＋桁数","日付",null,"○","○","○","名称＋属性\n+桁数","46",{"$f":"IF($Z118=\"\",\"\",VLOOKUP($Z118,$AF$6:$AM$73,3,))","v":"賞味期限製造年月日"},"X",6,0]
[null,null,"99",null,"製造ロット番号",null,"X",10,null,null,"出荷商品の製造ロット番号を指定する",null,null,null,null,null,null,null,null,null,null,"○","属性初期値","◎",null,null,"","","",""]
[null,null,"100",null,"温度管理区分",null,"X",1,null,null,"該当商品の温度帯管理区",null,null,null,null,null,"△/0:常温\n1:28℃以下\n2:20℃以下\n\n","3:冷蔵(10℃以下)\n4:冷凍(-15℃\n                 以下)",null,"ｺｰﾄﾞ",null,"○","属性初期値","◎",null,null,"","","",""]
[null,null,"101","   ③ トレーラレコード","製品容器区分",null,9,1,null,null,"該当商品の製品・容器かを指定",null,null,null,null,null,"0:製品","1:容器",null,"ｺｰﾄﾞ",null,"○","属性初期値","◎",null,null,"","","",""]
[null,null,"102",null,"外箱GTIN(ITF)コード",null,"X",14,null,null,"実際に入庫する外箱のＩＴＦコードを指定する",null,null,null,null,null,null,null,null,null,null,"○","属性初期値","◎",null,null,"","","",""]
[null,null,"103",null,"摘要",null,"X/N",50,null,null,"任意使用",null,"(英数カナは50文字、漢字は25文字)",null,null,null,null,null,null,null,null,"○","属性初期値","◎",null,null,"","","",""]
[null,null,"104",null,"日本語区分（商品名）",null,"X",1,null,null,"該当項目の日本語区分",null,null,null,null,null,"△/0:英数カナ\n1:　　漢字(S-JIS/JIS/JEF/IBM)",null,null,"ｺｰﾄﾞ",null,"○","属性初期値","◎",null,null,"","","",""]
[null,null,"105",null,"日本語区分（摘要）",null,"X",1,null,null,"　　〃 ",null,null,null,null,null,"　　〃 ",null,null,"ｺｰﾄﾞ",null,"○","属性初期値","◎",null,null,"","","",""]
[null,null,"106",null,"菓子業界商品分類コード",null,"X",6,null,null,"菓子業界の新商品分類コード",null,"(JICFSの機能分類コードとして登録)",null,null,null,null,null,null,null,null,"○","属性初期値","◎",null,null,"","","",""]
[null,null,"107",null,"割戻1","割戻計算区分","X",1,null,null,null,null,"(未使用)",null,null,null,null,null,null,null,null,"○","属性初期値","◎",null,null,"","","",""]
[null,null,"108",null,null,"割戻区分","X",1,null,null,null,null,"(未使用)",null,null,null,null,null,null,null,null,"○","属性初期値","◎",null,null,"","","",""]
[null,null,"109",null,null,"割戻基準","X",1,null,null,null,null,"(未使用)",null,null,null,null,null,null,null,null,"○","属性初期値","◎",null,null,"","","",""]
[null,null,"110",null,null,"割戻率／単価",9,4,2,null,null,null,"(未使用)",null,null,null,null,null,null,null,null,"○","属性初期値","◎",null,null,"","","",""]
[null,null,"111",null,null,"割戻金額符号","X",1,null,null,null,null,"(未使用)",null,null,null,null,null,null,null,null,"○","属性初期値","◎",null,null,"","","",""]
[null,null,"112",null,null,"割戻金額",9,8,null,null,null,null,"(未使用)",null,null,null,null,null,null,null,null,"○","属性初期値","◎",null,null,"","","",""]
[null,null,"113",null,null,"割戻コード","X",5,null,null,null,null,"(未使用)",null,null,null,null,null,null,null,null,"○","属性初期値","◎",null,null,"","","",""]
[null,null,"114",null,"割戻2","割戻計算区分","X",1,null,null,null,null,"(未使用)",null,null,null,null,null,null,null,null,"○","属性初期値","◎",null,null,"","","",""]
[null,null,"115",null,null,"割戻区分","X",1,null,null,null,null,"(未使用)",null,null,null,null,null,null,null,null,"○","属性初期値","◎",null,null,"","","",""]
[null,null,"116",null,null,"割戻基準","X",1,null,null,null,null,"(未使用)",null,null,null,null,null,null,null,null,"○","属性初期値","◎",null,null,"","","",""]
[null,null,"117",null,null,"割戻率／単価",9,4,2,null,null,null,"(未使用)",null,null,null,null,null,null,null,null,"○","属性初期値","◎",null,null,"","","",""]
[null,null,"118",null,null,"割戻金額符号","X",1,null,null,null,null,"(未使用)",null,null,null,null,null,null,null,null,"○","属性初期値","◎",null,null,"","","",""]
[null,null,"119",null,null,"割戻金額",9,8,null,null,null,null,"(未使用)",null,null,null,null,null,null,null,null,"○","属性初期値","◎",null,null,"","","",""]
[null,null,"120",null,null,"割戻コード","X",5,null,null,null,null,"(未使用)",null,null,null,null,null,null,null,null,"○","属性初期値","◎",null,null,"","","",""]
[null,null,"121",null,"割戻3","割戻計算区分","X",1,null,null,null,null,"(未使用)",null,null,null,null,null,null,null,null,"○","属性初期値","◎",null,null,"","","",""]
[null,null,"122",null,null,"割戻区分","X",1,null,null,null,null,"(未使用)",null,null,null,null,null,null,null,null,"○","属性初期値","◎",null,null,"","","",""]
[null,null,"123",null,null,"割戻基準","X",1,null,null,null,null,"(未使用)",null,null,null,null,null,null,null,null,"○","属性初期値","◎",null,null,"","","",""]
[null,null,"124",null,null,"割戻率／単価",9,4,2,null,null,null,"(未使用)",null,null,null,null,null,null,null,null,"○","属性初期値","◎",null,null,"","","",""]
[null,null,"125",null,null,"割戻金額符号","X",1,null,null,null,null,"(未使用)",null,null,null,null,null,null,null,null,"○","属性初期値","◎",null,null,"","","",""]
[null,null,"126",null,null,"割戻金額",9,8,null,null,null,null,"(未使用)",null,null,null,null,null,null,null,null,"○","属性初期値","◎",null,null,"","","",""]
[null,null,"127",null,null,"割戻コード","X",5,null,null,null,null,"(未使用)",null,null,null,null,null,null,null,null,"○","属性初期値","◎",null,null,"","","",""]
[null,null,"128",null,"明細連携エリア",null,"X",10,null,null,"新フォーマット間：相対利用可能エリア",null,null,null,null,null,null,null,null,null,null,"○","属性初期値","◎",null,null,"","","",""]
[null,1.8,"129","レコード件数",null,null,9,6,null,"○","レコードの総件数\n・データ送信側では、自身のフォーマットのレコード件数を設定する。\n・データ受信側では、当項目と実際のレコード件数の整合性チェックには利用しない。※下記【トレーラレコード連携時の留意事項】を参照のこと\n",null,null,null,null,null,null,null,"属性＋桁数","属性","センタチェック","※ センター集計値","　　※ センター集計値",null,null,"48","レコード件数","9",6,0]
[null,null,"130","伝票枚数",null,null,9,6,null,null,"伝票枚数",null,null,null,null,null,null,null,"属性＋桁数","属性","と同じ","※ センター集計値","　　※ センター集計値",null,null,"49","伝票枚数","9",6,0]
[null,null,"131","合計金額符号",null,null,"X",1,null,null,"合計金額の符号",null,null,null,null,null,"△/＋:正数","－:負数","属性","ｺｰﾄﾞ",null,"※ センター設定　 ","　　※ センター設定　 ","○","コード","50","合計金額符号","X",1,0]
[null,null,"132","合計金額",null,null,9,10,null,null,"卸店入金額の全明細行の金額合計",null,null,null,null,null,null,null,"属性＋桁数","属性",null,"※ センター集計値","　　※ センター集計値",null,null,"51","合計金額","9",10,0]
[null,null,"133","連携エリア",null,null,"X",20,null,null,"新フォーマット間：相対利用可能エリア",null,null,null,null,null,null,null,null,null,null,"○","属性初期値","◎",null,null,"","","",""]
[null,1.1000000000000001,"134","一次店カナ名",null,null,"X",30,null,null,"一次店カナ名",null,"(一次店名 に漢字を設定する場合、必須)",null,null,null,null,null,null,null,null,"○","属性初期値","◎",null,null,"","","",""]
[null,1.1000000000000001,"135","二次店カナ名",null,null,"X",30,null,null,"二次店カナ名",null,"(二次店名 に漢字を設定する場合、必須)",null,null,null,null,null,null,null,null,"○","属性初期値","◎",null,null,"","","",""]
[null,1.1000000000000001,"136","届け先カナ名",null,null,"Ｘ","30",null,null,"届け先カナ名",null,"(届け先名  に漢字を設定する場合、必須)",null,null,null,null,null,null,null,null,"○","属性初期値","◎",null,null,"","","",""]
[null,1.1000000000000001,"137","摘要カナ",null,null,"Ｘ","30",null,null,"摘要カナ",null,"(摘要        に漢字を設定する場合、必須)",null,null,null,null,null,null,null,null,"○","属性初期値","◎",null,null,"","","",""]
[null,1.1000000000000001,"138","商品名カナ",null,null,"X","25",null,null,"商品名カナ",null,"(商品名     に漢字を設定する場合、必須)",null,null,null,null,null,null,null,null,"○","属性初期値","◎",null,null,"","","",""]
[null,null,"139","改行コード",null,null,"X","2",null,null,"S-JISの改行コードを設定",null,null,null,null,null,null,null,null,null,null,null,null,null,null,null,"","","",""]
[null,null,null,null,null,null,null,null,null,null,null,null,null,null,null,null,null,null,null,null,null,"※ 配信分割時",null,null,null,null,{"$f":"IF($Z160=\"\",\"\",VLOOKUP($Z160,$AF$149:$AM$161,2,))","v":""},{"$f":"IF($Z160=\"\",\"\",VLOOKUP($Z160,$AF$149:$AM$161,6,))","v":""},{"$f":"IF($Z160=\"\",\"\",VLOOKUP($Z160,$AF$149:$AM$161,7,))","v":""},{"$f":"IF($Z160=\"\",\"\",VLOOKUP($Z160,$AF$149:$AM$161,8,))","v":""}]
[null,null,null,null,null,null,null,null,null,null,null,null,null,null,null,null,null,null,null,null,null,null,null,null,null,null,{"$f":"IF($Z161=\"\",\"\",VLOOKUP($Z161,$AF$149:$AM$161,2,))","v":""},{"$f":"IF($Z161=\"\",\"\",VLOOKUP($Z161,$AF$149:$AM$161,6,))","v":""},{"$f":"IF($Z161=\"\",\"\",VLOOKUP($Z161,$AF$149:$AM$161,7,))","v":""},{"$f":"IF($Z161=\"\",\"\",VLOOKUP($Z161,$AF$149:$AM$161,8,))","v":""}]
[null,null,null,null,null,null,null,null,null,null," ※ファイルの形式は、カンマ区切りの可変長形式となります。各項目の値にダブルクォート「\"」の囲みは不要です。"]
[null,null,null,null,null,null,null,null,null,null," ※画面から受信（ダウンロード）したファイルの最終行にはエンドレコードが出力されます。"]
[null,null,null,null,null,null,null,null,null,null,"　  エンドレコードのレイアウトは「エンドレコード」を参照してください。"]
[null,null,null,null,null,null,null,null,null,null," ※画面から送信（アップロード）するファイルにエンドレコードは不要です。"]

{"sheet":"１４受領","index":10,"n_rows":187,"n_cols":40,"rows_kept":187,"cut":false,"hidden":false,"merged":[[17,38,18,38],[17,39,18,39],[138,31,139,31],[138,32,139,33],[138,35,139,35],[138,36,139,36],[138,37,139,37],[138,38,139,38],[138,39,139,39],[17,31,18,31],[17,32,18,33],[17,35,18,35],[17,36,18,36],[17,37,18,37],[91,39,92,39],[91,37,92,37],[3,38,4,38],[3,1,4,1],[3,2,4,2],[3,3,4,4],[3,6,4,6],[3,7,4,7],[71,8,72,8],[71,9,72,9],[71,10,72,10],[71,16,72,16],[3,39,4,39],[3,8,4,8],[3,9,4,9],[3,10,4,10],[3,16,4,16],[3,23,3,27],[3,31,4,31],[4,23,4,24],[3,32,4,33],[3,35,4,35],[3,36,4,36],[3,37,4,37],[71,1,72,1],[71,2,72,2],[71,3,72,4],[71,6,72,6],[71,7,72,7],[71,23,71,27],[72,23,72,24],[45,16,45,17],[50,16,50,17],[84,16,84,17],[80,16,80,17],[131,1,132,1],[131,2,132,2],[131,3,132,4],[131,6,132,6],[131,7,132,7],[91,38,92,38],[131,8,132,8],[131,9,132,9],[131,10,132,10],[131,16,132,16],[170,10,170,15],[132,23,132,24],[95,16,95,17],[91,35,92,35],[91,36,92,36],[145,16,145,17],[131,23,131,27],[91,31,92,31],[91,32,92,33],[139,16,139,17]]}
[null,null,null,null,null,null,null,null,null,null,null,null,null,null,null,null,null,null,null,null,null,null,null,null,null,null,null,null,null,null,null,{"$f":"シート別総ページ数","v":{"$error":"#NAME?"}}]
[null,null,"（３）Ｖ２・１４受領",null,null,null,null,null,null,null,null,null,null,null,null,null,null,null,null,null,null,null,null,null,null,null,null,null,null,null,null,"（３）Ｖ１・１２受領"]
[null,null,"　","   ① コントロールレコード",null,null,null,null,null,null,null,null,null,null,null,null,null,null,null,null,null,null,null,null,null,null,null,null,null,null,null,"　","   ① コントロールレコード"]
[null,"変更","項番","　項目",null,null,"属性","整数桁","小数桁","必須","　項目説明",null,null,null,null,null,"　コード",null,"アップロード","V２ → Ｖ１･Ｖ２","Ｖ２→ Ｖ１","Ｖ２ ← Ｖ２","Ｖ２ ← Ｖ１","　　　　　　　Ｖ１フォーマット",null,null,null,null,null,null,null,"項番","　項目",null,null,"開始位置","属性","整数桁","小数桁","必須"]
[null,null,null,null,null,null,null,null,null,null,null,null,null,null,null,null,null,null,"チェック","センタチェック","センタチェック","コンバート","コンバート","比較・  変更点",null,"項番","　　項目","属性","整数","小数"]
[null,null,"1","データ種別",null,null,9,2,null,"◎","１４：受領データ",null,null,null,null,null,"14",null,"必須","ｺｰﾄﾞ",null,"○","\"14\"固定","○","ｺｰﾄﾞ",null,{"$f":"IF($Z6=\"\",\"\",VLOOKUP($Z6,$AF$6:$AN$16,2,))","v":""},{"$f":"IF($Z6=\"\",\"\",VLOOKUP($Z6,$AF$6:$AN$16,6,))","v":""},{"$f":"IF($Z6=\"\",\"\",VLOOKUP($Z6,$AF$6:$AN$16,7,))","v":""},{"$f":"IF($Z6=\"\",\"\",VLOOKUP($Z6,$AF$6:$AN$16,8,))","v":""},null,"1","データ種別",null,null,1,"9",2,null,"○"]
[null,null,"2","最終トレーラ判定区分",null,null,"X",1,null,"◎","トレーラ判定の区分",null,null,null,null,null,"9:最終","△:それ以外",null,"ｺｰﾄﾞ",null,"○","9:最終、△:それ以外",null,null,null,{"$f":"IF($Z7=\"\",\"\",VLOOKUP($Z7,$AF$6:$AN$18,2,))","v":""},{"$f":"IF($Z7=\"\",\"\",VLOOKUP($Z7,$AF$6:$AN$18,6,))","v":""},{"$f":"IF($Z7=\"\",\"\",VLOOKUP($Z7,$AF$6:$AN$18,7,))","v":""},{"$f":"IF($Z7=\"\",\"\",VLOOKUP($Z7,$AF$6:$AN$18,8,))","v":""}]
[null,null,"３","送信先コード",null,null,9,8,null,"◎","送信先(メーカ)","の統一取引先コード",null,null,null,null,null,null,"必須＋属性＋桁数＋登録","センター登録",null,"○","○",null,null,"2",{"$f":"IF($Z8=\"\",\"\",VLOOKUP($Z8,$AF$6:$AN$16,2,))","v":"送信先コード"},{"$f":"IF($Z8=\"\",\"\",VLOOKUP($Z8,$AF$6:$AN$16,6,))","v":"9"},{"$f":"IF($Z8=\"\",\"\",VLOOKUP($Z8,$AF$6:$AN$16,7,))","v":8},{"$f":"IF($Z8=\"\",\"\",VLOOKUP($Z8,$AF$6:$AN$16,8,))","v":0},null,"2","送信先コード",null,null,3,"9",8,null,"○"]
[null,null,"４","送信元コード",null,null,9,8,null,"◎","送信元(卸)     ","の統一取引先コード",null,null,null,null,null,null,"必須＋属性＋桁数＋登録","センター登録",null,"○","○",null,null,"3","送信元コード","9",8,0,null,"3","送信元コード",null,null,11,"9",8,null,"○"]
[null,null,"5","データ作成日",null,null,9,8,null,"◎","データ作成日付",null,"(西暦 YYYYMMDD)",null,null,null,null,null,null,"必須＋日付","センタチェック","○","○",null,null,"5","データ作成日","9",8,0,null,"5","データ作成日",null,null,20,"9",8,null,"○"]
[null,null,"6","データ作成時刻",null,null,9,6,null,null,"データ作成時刻",null,"(HHMMSS)",null,null,null,null,null,null,"時刻","と同じ","○","属性初期値","◎",null,null,"","","","",null,"6","送信先名",null,null,28,"X",20,null,"○"]
[null,null,"7","送信先名",null,null,"X",20,null,"○","送信先(メーカ)名          ",null,"(英数カナのみ)",null,null,null,null,null,"属性",null,null,"○","○",null,null,"6","送信先名","X",20,0,null,"7","送信元名",null,null,48,"X",20,null,"○"]
[null,null,"8","送信元名",null,null,"X",20,null,"◎","送信元(卸)名 　          　",null,"(英数カナのみ)",null,null,null,null,null,"属性","必須",null,"○","○",null,null,"7","送信元名","X",20,0,null,"8","直接送信先コード",null,null,68,"9",8]
[null,null,"9","直接送信先コード",null,null,9,8,null,null,"送信先コードと異なる場合にセット          ",null,"(通常はゼロ)",null,null,null,null,null,null,"センター登録",null,"○","○",null,null,"8","直接送信先コード","9",8,0,null,"9","直接送信先カナ名",null,null,76,"X",20]
[null,null,"10","直接送信先名",null,null,"X",20,null,null,"直接送信先名",null,"(英数カナのみ、通常はスペース)",null,null,null,null,null,"属性",null,null,"○","○",null,null,"9","直接送信先カナ名","X",20,0,null,"10","予備",null,null,96,"X",161]
[null,null,"11","送信ファイルNO",null,null,9,2,null,null,"同時送信時の問合せ№",null,"(00～99)",null,null,null,null,null,null,"属性",null,"○","属性初期値","◎",null,null,"","","",""]
[null,null,"12","連携エリア",null,null,"X",20,null,null,"新フォーマット間：相対利用可能エリア",null,null,null,null,null,null,null,null,null,null,"○","属性初期値","◎",null,null,"","","","",null,null,"   ② ヘッダーレコード"]
[null,null,"13","卸発注伝票NO",null,null,9,8,null,"○","受発注データの卸伝票№",null,"(6桁→8桁に拡張、6桁運用の時は上２桁ゼロ埋め）",null,null,null,null,null,"属性＋桁数","属性",null,"○","予備上2桁(不正時\"00\")\n＋卸伝票NO","○","桁数","21\n5","予備\n卸伝票NO","X\n9","100\n6",0,null,"項番","　項目",null,null,"開始位置","属性","整数桁","小数桁","必須"]
[null,null,"14","メーカ伝票NO",null,null,9,8,null,null,"メーカ発行伝票№",null,"(6桁→8桁に拡張、6桁運用の時は上２桁ゼロ埋め）",null,null,null,null,null,null,"属性",null,"○","○","○","桁数","6",{"$f":"IF($Z19=\"\",\"\",VLOOKUP($Z19,$AF$18:$AN$45,2,))","v":"メーカ伝票NO"},{"$f":"IF($Z19=\"\",\"\",VLOOKUP($Z19,$AF$17:$AN$45,6,))","v":"9"},{"$f":"IF($Z19=\"\",\"\",VLOOKUP($Z19,$AF$17:$AN$45,7,))","v":6},{"$f":"IF($Z19=\"\",\"\",VLOOKUP($Z19,$AF$17:$AN$45,8,))","v":0}]
[null,null,"15","店入直送区分",null,null,9,1,null,null,"店(倉)入れまたは直送等の区分",null,null,null,null,null,"1:店入\n2:直送\n","3:店引取\n4:直送引取",null,"ｺｰﾄﾞ",null,"○","\"1\"固定","◎",null,null,"","","","",null,"1","データ種別",null,null,1,"9",2,null,"○"]
[null,2.7,"16","取引コード",null,null,9,2,null,"○","業界統一取引コード",null,null,null,null,null,"11:店入売上\n12:店入売上訂正\n21:店入返品\n22:店入返品訂正\n31:直送売上\n32:直送売上訂正\n\n\n\n","41:直送返品\n42:直送返品訂正\n51:割戻し金\n52:相殺\n81:ﾒｰｶｰ提供の役務\n91:卸提供の役務",null,"ｺｰﾄﾞ",null,"○","○",null,null,"8","取引コード","9",2,0,null,"2","送信先コード",null,null,3,"9",8,null,"○"]
[null,null,"17","納品日",null,null,9,8,null,"○","発注伝票の納品日",null,"(西暦 YYYYMMDD)",null,null,null,null,null,"属性＋桁数","日付",null,"○","○",null,null,"9","納品日","9",8,0,null,"3","送信元コード",null,null,11,"9",8,null,"○"]
[null,null,"18","出荷日",null,null,9,8,null,"○","実出荷日",null,"(西暦 YYYYMMDD)",null,null,null,null,null,"属性＋桁数","日付",null,"○","○",null,null,"10","出荷日","9",8,0,null,"4","レコード区分",null,null,19,"9",1,null,"○"]
[null,null,"19","受領日",null,null,9,8,null,"○","受領した日付",null,"(西暦 YYYYMMDD)",null,null,null,null,null,"属性＋桁数","日付",null,"○","○",null,null,"11","受領日","9",8,0,null,"5","卸伝票NO",null,null,20,"9",6,null,"○"]
[null,null,"20","受領時間",null,null,9,4,null,null,"受領した時間",null,"(HHMM)",null,null,null,null,null,null,"時刻",null,"○","○",null,null,"12","受領時間","9",4,0,null,"6","メーカ伝票NO",null,null,26,"9",6]
[null,null,"21","倉庫コード",null,null,"X",4,null,null,"メーカの出荷倉庫を識別",null,"(相対協議)",null,null,null,null,null,null,null,null,"○","属性初期値","◎",null,null,"","","","",null,"7","元伝NO",null,null,32,"9",6]
[null,null,"22","伝送区分",null,null,"X",1,null,null,null,null,"(未使用)",null,null,null,null,null,null,null,null,"○","属性初期値","◎",null,null,"","","","",null,"8","取引コード",null,null,38,"9",2,null,"○"]
[null,null,"23","出荷報告以外区分",null,null,"X",1,null,null,null,null,"(未使用)",null,null,null,null,null,null,null,null,"○","属性初期値","◎",null,null,"","","","",null,"9","納品日",null,null,40,"9",8,null,"○"]
[null,null,"24","集計明細区分",null,null,"X",1,null,null,null,null,"(未使用)",null,null,null,null,null,null,null,null,"○","属性初期値","◎",null,null,"","","","",null,"10","出荷日",null,null,48,"9",8,null,"○"]
[null,null,"25","請求締日",null,null,9,8,null,null,null,null,"(未使用)",null,null,null,null,null,null,null,null,"○","属性初期値","◎",null,null,"","","","",null,"11","受領日",null,null,56,"9",8,null,"○"]
[null,null,"26","請求口座",null,null,"X",10,null,null,null,null,"(未使用)",null,null,null,null,null,null,null,null,"○","属性初期値","◎",null,null,"","","","",null,"12","受領時間",null,null,64,"9",4]
[null,null,"27","請求支払区分",null,null,9,2,null,null,null,null,"(未使用)",null,null,null,null,null,null,null,null,"○","属性初期値","◎",null,null,"","","","",null,"13","明細行数",null,null,68,"9",2,null,"○"]
[null,null,"28","明細行数",null,null,9,2,null,"○","伝票内明細数",null,null,null,null,null,"00～06",null,null,"ｺｰﾄﾞ",null,"○","○",null,null,"13","明細行数","9",2,0,null,"14","届け先コード",null,null,70,"9",8,null,"○"]
[null,null,"29","一次店コード",null,null,"X",13,null,"◎","統一取引先コード(8桁)",null,null,null,"(後方スペース埋め)",null,null,null,"必須＋桁数","必須",null,"○","届け先コード\n前詰８桁＋空白５桁","◎",null,null,"","","","",null,"15","届け先カナ名",null,null,78,"X",30,null,"○"]
[null,null,"30","二次店コード",null,null,"X",13,null,null,"統一取引先コード(8桁)／プライベート・コード(3～8桁)／ＧＬＮ(13桁)",null,null,null,"(後方スペース埋め)",null,null,null,"桁数",null,null,"○","属性初期値","◎",null,null,"","","","",null,"16","伝票合計金額符号",null,null,108,"X",1,null,"○"]
[null,null,"31","三次店コード",null,null,"X",13,null,null,"統一取引先コード(8桁)／プライベート・コード(3～8桁)／ＧＬＮ(13桁)",null,null,null,"(後方スペース埋め)",null,null,null,"桁数",null,null,"○","属性初期値","◎",null,null,"","","","",null,"17","伝票合計金額",null,null,109,"9",8,null,"○"]
[null,null,"32","届け先コード",null,null,"X",13,null,"○","統一取引先コード(8桁)／プライベート・コード(3～8桁)／ＧＬＮ(13桁)",null,null,null,"(後方スペース埋め)",null,null,null,"桁数",null,null,"○","前詰８桁＋空白５桁","○","属性＋桁数","14","届け先コード","9",8,0,null,"18","定番特売区分",null,null,117,"X",1,null,"○"]
[null,null,"33","チェーン店コード",null,null,"X",13,null,null,"統一取引先コード(8桁)／プライベート・コード(3～8桁)／ＧＬＮ(13桁)",null,null,null,"(後方スペース埋め)",null,null,null,"桁数",null,null,"○","属性初期値","◎",null,null,"","","","",null,"19","摘要欄",null,null,118,"X",30]
[null,null,"34","専用伝票日付",null,null,9,8,null,null,null,null,"(未使用)",null,null,null,null,null,null,null,null,"○","属性初期値","◎",null,null,"","","","",null,"20","メーカコード",null,null,148,"X",9,null,"○"]
[null,null,"35","専用伝票NO",null,null,9,9,null,null,null,null,"(未使用)",null,null,null,null,null,null,null,null,"○","属性初期値","◎",null,null,"","","","",null,"21","予備",null,null,157,"X",100]
[null,null,"36","元伝年月日",null,null,9,8,null,null,null,null,"(未使用)",null,null,null,null,null,null,null,null,"○","属性初期値","◎",null,null,"","","",""]
[null,null,"37","元伝NO",null,null,9,8,null,null,null,null,"(未使用)",null,null,null,null,null,null,null,null,"○","○","○","桁数","7","元伝NO","9",6,0]
[null,null,"38","伝票合計金額符号",null,null,"X",1,null,"○","伝票の合計金額の符号",null,null,null,null,null,"△/＋:正数","－:負数","属性","ｺｰﾄﾞ",null,"○","○","○","ｺｰﾄﾞ","16","伝票合計金額符号","X",1,0]
[null,null,"39","伝票合計金額",null,null,9,8,null,"○","伝票の合計金額",null,"(卸店入価格、１億円未満)",null,null,null,null,null,"属性＋桁数","属性",null,"○","○",null,null,"17","伝票合計金額","9",8,0]
[null,null,"40","二次店納入合計金額符号",null,null,"X",1,null,null,"正味納入合計金額の符号",null,null,null,null,null,"△/＋:正数","－:負数","属性","ｺｰﾄﾞ",null,"○","属性初期値","◎",null,null,"","","",""]
[null,null,"41","二次店納入合計金額",null,null,9,8,null,null,"正味納入合計金額",null,"(二次店納入価格、１億円未満）",null,null,null,null,null,"属性＋桁数","属性",null,"○","属性初期値","◎",null,null,"","","",""]
[null,null,"42","一次店名",null,null,"X/N",40,null,null,"一次店名",null,"(英数カナは30文字、漢字は20文字)",null,null,null,null,null,null,null,null,"○","属性初期値","◎",null,null,"","","",""]
[null,null,"43","二次店名",null,null,"X/N",40,null,null,"二次店名",null,"(英数カナは30文字、漢字は20文字)",null,null,null,null,null,null,null,null,"○","属性初期値","◎",null,null,"","","",""]
[null,null,"44","三次店名",null,null,"X/N",40,null,null,"三次店名",null,"(英数カナは30文字、漢字は20文字)",null,null,null,null,null,null,null,null,"○","属性初期値","◎",null,null,"","","",""]
[null,null,"45","届け先名",null,null,"X/N",40,null,"○","届け先名",null,"(英数カナは30文字、漢字は20文字)",null,null,null,null,null,null,null,null,"○","○","○","属性＋桁数","15","届け先カナ名","X",30,0]
[null,null,"46","チェーン店名",null,null,"X/N",40,null,null,"チェーン店名",null,"(英数カナは30文字、漢字は20文字)",null,null,null,null,null,null,null,null,"○","属性初期値","◎",null,null,"","","",""]
[null,null,"47","電話番号",null,null,"X",15,null,null,"通常は届け先の電話番号  ",null,"(局番区切り(-)あり)",null,null,null,null,null,null,null,null,"○","属性初期値","◎",null,null,"","","",""]
[null,null,"48","住所",null,null,"X/N",80,null,null,"通常は届け先の住所         ",null,"(英数カナは60文字、漢字は40文字)",null,null,null,null,null,null,null,null,"○","属性初期値","◎",null,null,"","","",""]
[null,null,"49","摘要",null,null,"X/N",50,null,null,"伝票の摘要欄の内容",null,"(英数カナは50文字、漢字は25文字）",null,null,null,null,null,null,null,null,"○","○","○","属性＋桁数","19","摘要欄","X",30,0]
[null,null,"50","メーカコード",null,null,"X",9,null,"○","７桁の場合は後ろスペース",null,"(49xxxxx / 45xxxxxxx)",null,null,null,null,null,"属性",null,null,"○","○",null,null,"20","メーカコード","X",9,0]
[null,null,"51","メーカ所属組織名",null,null,"X",10,null,null,null,null,"(未使用)",null,null,null,null,null,null,null,null,"○","属性初期値","◎",null,null,"","","",""]
[null,null,"（次頁に続く）"]
[]
[]
[]
[]
[]
[]
[]
[]
[]
[]
[]
[]
[]
[null,null,"（前頁の続き）"]
[null,"変更","項番","　項目",null,null,"属性","整数桁","小数桁","必須","　項目説明",null,null,null,null,null,"　コード",null,"アップロード","V２ → Ｖ１･Ｖ２","Ｖ２→ Ｖ１","Ｖ２ ← Ｖ２","Ｖ２ ← Ｖ１","　　　　　　　Ｖ１フォーマット"]
[null,null,null,null,null,null,null,null,null,null,null,null,null,null,null,null,null,null,"チェック","センタチェック","センタチェック","コンバート","コンバート","比較・  変更点",null,"項番","　　項目","属性","整数","小数"]
[null,null,"52","伝票区分",null,null,9,1,null,null,null,null,"(未使用)",null,null,null,null,null,null,null,null,"○","属性初期値","◎",null,null,{"$f":"IF($Z74=\"\",\"\",VLOOKUP($Z74,$AF$18:$AN$45,2,))","v":""},{"$f":"IF($Z74=\"\",\"\",VLOOKUP($Z74,$AF$17:$AN$45,6,))","v":""},{"$f":"IF($Z74=\"\",\"\",VLOOKUP($Z74,$AF$17:$AN$45,7,))","v":""},{"$f":"IF($Z74=\"\",\"\",VLOOKUP($Z74,$AF$17:$AN$45,8,))","v":""}]
[null,null,"53","登録店区分",null,null,"X",1,null,null,null,null,"(未使用)",null,null,null,null,null,null,null,null,"○","属性初期値","◎",null,null,"","","",""]
[null,null,"54","定番特売区分",null,null,"X",1,null,"○","定番発注/特売発注の区分",null,null,null,null,null,"0:定番\n1:特売\n","△:分類不能","属性","ｺｰﾄﾞ",null,"○","\"0\"・\"1\"以外 → \"△\"","○","ｺｰﾄﾞ","18","定番特売区分","X",1,0]
[null,null,"55","消費税区分",null,null,"X",1,null,null,"税区分",null,null,null,null,null,"1:外税\n2:内税\n","3:非課税\n△:個別判断",null,"ｺｰﾄﾞ",null,"○","属性初期値","◎",null,null,"","","",""]
[null,null,"56","消費税率",null,null,9,2,1,null,"消費税の税率(99.9％)、ゼロ:個別判断　",null,null,"(小数点以下1桁)",null,null,null,null,"属性＋桁数","属性",null,"○","属性初期値","◎",null,null,"","","",""]
[null,null,"57","ロット不足運賃負担区分",null,null,"X",1,null,null,"発注ロット不足になった場合の運賃負担の区分",null,null,null,null,null,"△:無指定\n1:卸負担\n","2:負担なし",null,"ｺｰﾄﾞ",null,"○","属性初期値","◎",null,null,"","","",""]
[null,null,"58","取引先区分（一次店）",null,null,"X",1,null,null,"該当項目の取引先の属性区分",null,null,null,null,null,"△:統一取引先(8桁)",null,null,"ｺｰﾄﾞ",null,"○","属性初期値","◎",null,null,"","","",""]
[null,null,"59","取引先区分（二次店）",null,null,"X",1,null,null,"　　〃 ",null,null,null,null,null,"△:  統一取引先(8桁)\n6:   GLN(13桁)\n7/8:プライベートコード(卸/ﾒｰｶ)",null,null,"ｺｰﾄﾞ",null,"○","属性初期値","◎",null,null,"","","",""]
[null,null,"60","取引先区分（三次店）",null,null,"X",1,null,null,"　　〃 ",null,null,null,null,null,"　　〃 ",null,null,"ｺｰﾄﾞ",null,"○","属性初期値","◎",null,null,"","","",""]
[null,null,"61","取引先区分（届け先）",null,null,"X",1,null,null,"　　〃 ",null,null,null,null,null,"　　〃 ",null,null,"ｺｰﾄﾞ",null,"○","属性初期値","◎",null,null,"","","",""]
[null,null,"62","取引先区分（チェーン店）",null,null,"X",1,null,null,"　　〃 ",null,null,null,null,null,"　　〃 ",null,null,"ｺｰﾄﾞ",null,"○","属性初期値","◎",null,null,"","","",""]
[null,null,"63","日本語区分（一次店）",null,null,"X",1,null,null,"該当項目の日本語区分",null,null,null,null,null,"△/0:英数カナ\n1:　　漢字(S-JIS/JIS/JEF/IBM)",null,null,"ｺｰﾄﾞ",null,"○","属性初期値","◎",null,null,"","","",""]
[null,null,"64","日本語区分（二次店）",null,null,"X",1,null,null,"　　〃 ",null,null,null,null,null,"　　〃 ",null,null,"ｺｰﾄﾞ",null,"○","属性初期値","◎",null,null,"","","",""]
[null,null,"65","日本語区分（三次店）",null,null,"X",1,null,null,"　　〃 ",null,null,null,null,null,"　　〃 ",null,null,"ｺｰﾄﾞ",null,"○","属性初期値","◎",null,null,"","","",""]
[null,null,"66","日本語区分（届け先）",null,null,"X",1,null,null,"　　〃 ",null,null,null,null,null,"　　〃 ",null,null,"ｺｰﾄﾞ",null,"○","属性初期値","◎",null,null,"","","",""]
[null,null,"67","日本語区分（チェーン店）",null,null,"X",1,null,null,"　　〃 ",null,null,null,null,null,"　　〃 ",null,null,"ｺｰﾄﾞ",null,"○","属性初期値","◎",null,null,"","","",""]
[null,null,"68","日本語区分（住所）",null,null,"X",1,null,null,"　　〃 ",null,null,null,null,null,"　　〃 ",null,null,"ｺｰﾄﾞ",null,"○","属性初期値","◎",null,null,"","","",""]
[null,null,"69","日本語区分（摘要）",null,null,"X",1,null,null,"　　〃 ",null,null,null,null,null,"　　〃 ",null,null,"ｺｰﾄﾞ",null,"○","属性初期値","◎",null,null,"","","","",null,null,"   ③ 明細レコード"]
[null,null,"70","ヘッダー連携エリア",null,null,"X",20,null,null,"新フォーマット間：相対利用可能エリア",null,null,null,null,null,null,null,null,null,null,"○","属性初期値","◎",null,null,"","","","",null,"項番","　項目",null,null,"開始位置","属性","整数桁","小数桁","必須"]
[null,null,null,"明細部（４００バイト）　　　　　　　　　　"]
[null,null,"71",null,"明細行NO",null,9,2,null,"◎","伝票内明細数",null,null,null,null,null,"01～06",null,null,"必須＋ｺｰﾄﾞ",null,"○","○","○","名称","5",{"$f":"IF($Z94=\"\",\"\",VLOOKUP($Z94,$AF$94:$AN$120,3,))","v":"行NO"},{"$f":"IF($Z94=\"\",\"\",VLOOKUP($Z94,$AF$94:$AN$120,6,))","v":"9"},{"$f":"IF($Z94=\"\",\"\",VLOOKUP($Z94,$AF$94:$AN$120,7,))","v":2},{"$f":"IF($Z94=\"\",\"\",VLOOKUP($Z94,$AF$94:$AN$120,8,))","v":0},null,"1","データ種別",null,null,1,"9",2,null,"○"]
[null,null,"72",null,"専用伝票行NO",null,9,2,null,null,"専用伝票の行№",null,"(00～99)",null,null,null,null,null,null,"属性",null,"○","○",null,null,"6",{"$f":"IF($Z95=\"\",\"\",VLOOKUP($Z95,$AF$94:$AN$120,3,))","v":"専用伝票行NO"},{"$f":"IF($Z95=\"\",\"\",VLOOKUP($Z95,$AF$94:$AN$120,6,))","v":"9"},{"$f":"IF($Z95=\"\",\"\",VLOOKUP($Z95,$AF$94:$AN$120,7,))","v":2},{"$f":"IF($Z95=\"\",\"\",VLOOKUP($Z95,$AF$94:$AN$120,8,))","v":0},null,"2","送信先コード",null,null,3,"9",8,null,"○"]
[null,null,"73",null,"商品コード識別区分",null,9,1,null,"○","品番(商品コード)の識別区分",null,null,null,null,null,"0:統一商品コード\n1:ＩＴＦコード (14桁)\n2:ＩＴＦコード(16桁)  【利用停止化】\n3:JANコード    (標準:13桁)\n4:JANコード    (短縮:8桁)\n6:GTINコード  (14桁)",null,"属性","コード(新)",null,"○","○","○","属性＋コード\n2:利用停止","7","商品コード識別区分","X",1,0,null,"3","送信元コード",null,null,11,"9",8,null,"○"]
[null,null,"74",null,"品番",null,"X",16,null,"○","統一商品ｺｰﾄﾞ､ITFｺｰﾄﾞ､JANｺｰﾄﾞ､GTINｺｰﾄﾞ",null,null,"(左詰め)",null,null,null,null,"属性",null,null,"○","○","○","ITF(16)\n利用停止","8","品番","X",16,0,null,"4","レコード区分",null,null,19,"9",1,null,"○"]
[null,null,"75",null,"商品名",null,"X/N",40,null,"○","商品名",null,"(英数カナは25文字、漢字は20文字)",null,null,null,null,null,null,null,null,"○","○","○","属性＋桁数","9","商品名","X",25,0,null,null,"明細部繰返（１１７バイト × ２明細）　　　　　　　　　　　　　"]
[null,null,"76",null,"包装区分",null,9,1,null,"◎","数量の発注単位の区分",null,"(1:ケース発注時)","(2:ボール発注時)","(3:バラ発注時)",null,"1:ケース発注\n2:ボール発注\n","3:バラ発注",null,"必須＋ｺｰﾄﾞ",null,"○","○",null,null,"10","包装区分","9",1,0,null,"5",null,"行NO",null,20,"9",2,null,"○"]
[null,null,"77",null,"内容","ボール内バラ数",9,4,2,"○","包装区分に準じた設定",null,"(ボール内バラ数","/ボール内バラ数","/ゼロ)",null,null,null,"属性＋桁数","属性",null,"○","○",null,null,"11",{"$f":"IF($Z100=\"\",\"\",VLOOKUP($Z100,$AF$94:$AN$120,4,))","v":"ボール内バラ数"},"9",4,2,null,"6",null,"専用伝票行NO",null,22,"9",2]
[null,null,"78",null,null,"ケース内ボール数",9,2,null,"○","包装区分に準じた設定",null,"(ケース内ボール数","/ゼロ","/ゼロ)",null,null,null,"属性＋桁数","属性",null,"○","○",null,null,"12",{"$f":"IF($Z101=\"\",\"\",VLOOKUP($Z101,$AF$94:$AN$120,4,))","v":"ケース内ボール数"},"9",2,0,null,"7",null,"商品コード識別区分",null,24,"X",1,null,"○"]
[null,null,"79",null,"数量符号",null,"X",1,null,"○","数量の符号",null,null,null,null,null,"△/＋:正数","－:負数","属性","ｺｰﾄﾞ",null,"○","○","○","コード\n2:利用停止","13","数量符号","X",1,0,null,"8",null,"品番",null,25,"X",16,null,"○"]
[null,null,"80",null,"数量","ケース数量",9,7,null,"○","包装区分に準じた設定",null,"(ケース数量","/ゼロ","/ゼロ)",null,null,null,"属性＋桁数","属性",null,"○","○",null,null,"14",{"$f":"IF($Z103=\"\",\"\",VLOOKUP($Z103,$AF$94:$AN$120,4,))","v":"ケース数量"},"9",7,0,null,"9",null,"商品名",null,41,"X",25,null,"○"]
[null,null,"81",null,null,"ボール数量",9,7,null,"○","包装区分に準じた設定",null,"(ゼロ","/ボール数量","/ゼロ)",null,null,null,"属性＋桁数","属性",null,"○","○",null,null,"15",{"$f":"IF($Z104=\"\",\"\",VLOOKUP($Z104,$AF$94:$AN$120,4,))","v":"ボール数量"},"9",7,0,null,"10",null,"包装区分",null,66,"9",1,null,"○"]
[null,null,"82",null,null,"バラ数量",9,7,2,"○","包装区分に準じた設定",null,"(バラ数量","/バラ数量","バラ数量)",null,null,null,"属性＋桁数","属性",null,"○","○",null,null,"16",{"$f":"IF($Z105=\"\",\"\",VLOOKUP($Z105,$AF$94:$AN$120,4,))","v":"バラ数量"},"9",7,2,null,"11",null,"内容","ボール内バラ数",67,"9",4,2,"○"]
[null,null,"83",null,"単価","卸店入価格",9,6,2,"○","卸店入価格",null,"(バラ単価)",null,null,null,null,null,"属性＋桁数","属性",null,"○","○",null,null,"17",{"$f":"IF($Z106=\"\",\"\",VLOOKUP($Z106,$AF$94:$AN$120,4,))","v":"卸店入価格"},"9",6,2,null,"12",null,null,"ケース内ボール数",73,"9",2,null,"○"]
[null,null,"84",null,null,"二次店納入価格",9,6,2,null,"二次卸店等への納入価格",null,"(バラ単価)",null,null,null,null,null,"属性＋桁数","属性",null,"○","○",null,null,"18",{"$f":"IF($Z107=\"\",\"\",VLOOKUP($Z107,$AF$94:$AN$120,4,))","v":"二次店納入価格"},"9",6,2,null,"13",null,"数量符号",null,75,"X",1,null,"○"]
[null,null,"85",null,"金額符号",null,"X",1,null,"○","金額の符号",null,null,null,null,null,"△/＋:正数","－:負数","属性","ｺｰﾄﾞ",null,"○","○","○","コード\n2:利用停止","19","金額符号","X",1,0,null,"14",null,"数量","ケース数量",76,"9",7,null,"○"]
[null,null,"86",null,"金額","卸店入金額",9,8,null,"○","卸店入金額",null,null,null,null,null,null,null,"属性＋桁数","属性",null,"○","○",null,null,"20",{"$f":"IF($Z109=\"\",\"\",VLOOKUP($Z109,$AF$94:$AN$120,4,))","v":"卸店入金額"},"9",8,0,null,"15",null,null,"ボール数量",83,"9",7,null,"○"]
[null,null,"87",null,null,"二次店納入金額",9,8,null,null,"二次卸店等への納入金額",null,null,null,null,null,null,null,"属性＋桁数","属性",null,"○","○",null,null,"21",{"$f":"IF($Z110=\"\",\"\",VLOOKUP($Z110,$AF$94:$AN$120,4,))","v":"二次店納入金額"},"9",8,0,null,"16",null,null,"バラ数量",90,"9",7,2,"○"]
[null,null,"88",null,"商品添付区分",null,"X",1,null,"○","添付商品扱いの区分",null,"(相対運用)",null,null,null,"△:売上げ\n1:現物添付","2:見本\n3:景品","属性","ｺｰﾄﾞ(新)",null,"○","\"0\" → \"△\"",null,null,"23","商品添付区分","X",1,0,null,"17",null,"単価","卸店入価格",99,"9",6,2,"○"]
[null,null,"89",null,"受領区分",null,9,2,null,"○","商品の受領状況を指定",null,null,null,null,null,"00:正常","01:数量違い有り",null,"ｺｰﾄﾞ(新)",null,"○","\"0\" + 数量違いフラグ","○","名称+桁数","22","数量違いフラグ","9",1,0,null,"18",null,null,"二次店納入価格",107,"9",6,2]
[null,null,"90",null,"入荷単位ケース数",null,9,2,null,null,"荷合せ品の場合の１梱包ケース数量を指定する",null,null,null,null,null,"00～20",null,"属性＋桁数","ｺｰﾄﾞ",null,"○","属性初期値","◎",null,null,"","","","",null,"19",null,"金額符号",null,115,"X",1,null,"○"]
[null,null,"91",null,"単価計算区分",null,"X",1,null,null,"単価×数量の計算方法を指定する",null,"(小数点以下端数の計算処置方法)",null,null,null,"△:切捨て\n1:切上げ","2:四捨五入",null,"ｺｰﾄﾞ",null,"○","属性初期値","◎",null,null,"","","","",null,"20",null,"金額","卸店入金額",116,"9",8,null,"○"]
[null,null,"（次頁に続く）",null,null,null,null,null,null,null,null,null,null,null,null,null,null,null,null,null,null,null,null,null,null,null,null,null,null,null,null,"21",null,null,"二次店納入金額",124,"9",8]
[null,null,null,null,null,null,null,null,null,null,null,null,null,null,null,null,null,null,null,null,null,null,null,null,null,null,null,null,null,null,null,"22",null,"数量違いフラグ",null,132,"9",1,null,"○"]
[null,null,null,null,null,null,null,null,null,null,null,null,null,null,null,null,null,null,null,null,null,null,null,null,null,null,null,null,null,null,null,"23",null,"商品添付区分",null,133,"X",1,null,"○"]
[null,null,null,null,null,null,null,null,null,null,null,null,null,null,null,null,null,null,null,null,null,null,null,null,null,null,null,null,null,null,null,"24",null,"予備１",null,134,"X",3]
[null,null,null,null,null,null,null,null,null,null,null,null,null,null,null,null,null,null,null,null,null,null,null,null,null,null,null,null,null,null,null,"25","予備２",null,null,254,"X",3]
[]
[]
[]
[]
[]
[]
[]
[]
[]
[]
[]
[null,null,"（前頁の続き）"]
[null,"変更","項番","　項目",null,null,"属性","整数桁","小数桁","必須","　項目説明",null,null,null,null,null,"　コード",null,"アップロード","V２ → Ｖ１･Ｖ２","Ｖ２→ Ｖ１","Ｖ２ ← Ｖ２","Ｖ２ ← Ｖ１","　　　　　　　Ｖ１フォーマット"]
[null,null,null,null,null,null,null,null,null,null,null,null,null,null,null,null,null,null,"チェック","センタチェック","センタチェック","コンバート","コンバート","比較・  変更点",null,"項番","　　項目","属性","整数","小数"]
[null,null,"92",null,"卸発注行番号",null,9,2,null,null,"卸売業での発注伝票行NO",null,"(00～99)",null,null,null,null,null,null,"属性",null,"○","属性初期値","◎",null,null,{"$f":"IF($Z134=\"\",\"\",VLOOKUP($Z134,$AF$94:$AN$111,3,))","v":""},{"$f":"IF($Z134=\"\",\"\",VLOOKUP($Z134,$AF$94:$AN$111,6,))","v":""},{"$f":"IF($Z134=\"\",\"\",VLOOKUP($Z134,$AF$94:$AN$111,7,))","v":""},{"$f":"IF($Z134=\"\",\"\",VLOOKUP($Z134,$AF$94:$AN$111,8,))","v":""}]
[null,null,"93",null,"卸最新在庫日付区分",null,"X",1,null,null,"卸最新在庫日付の日付区分",null,null,null,null,null,"△:未使用\n1:製造日\n","2:賞味期限",null,"ｺｰﾄﾞ",null,"○","属性初期値","◎",null,null,"","","",""]
[null,null,"94",null,"卸最新在庫日付",null,9,8,null,null,"賞味期限／製造日(YYYYMMDD) ",null,"(賞味年月表示は月末最終日）",null,null,null,null,null,"属性＋桁数","日付",null,"○","属性初期値","◎",null,null,"","","",""]
[null,null,"95",null,"入庫許容日付区分",null,"X",1,null,null,"入庫許容日付の日付区分",null,null,null,null,null,"△:未使用\n1:製造日\n","2:賞味期限",null,"ｺｰﾄﾞ",null,"○","属性初期値","◎",null,null,"","","",""]
[null,null,"96",null,"入庫許容日付",null,9,8,null,null,"賞味期限／製造日(YYYYMMDD) ",null,"(賞味年月表示は月末最終日）",null,null,null,null,null,"属性＋桁数","日付",null,"○","属性初期値","◎",null,null,"","","","",null,null,"   ④ トレーラレコード"]
[null,null,"97",null,"実入庫製品日付区分",null,"X",1,null,null,"実入庫製品日付の日付区分",null,null,null,null,null,"△:未使用\n1:製造日\n","2:賞味期限",null,"ｺｰﾄﾞ",null,"○","属性初期値","◎",null,null,"","","","",null,"項番","　項目",null,null,"開始位置","属性","整数桁","小数桁","必須"]
[null,null,"98",null,"実入庫製品日付",null,9,8,null,null,"賞味期限／製造日(YYYYMMDD) ",null,"(賞味年月表示は月末最終日）",null,null,null,null,null,"属性＋桁数","日付",null,"○","属性初期値","◎",null,null,"","","",""]
[null,null,"99",null,"製造ロット番号",null,"X",10,null,null,"出荷商品の製造ロット番号を指定する",null,null,null,null,null,null,null,null,null,null,"○","属性初期値","◎",null,null,"","","","",null,"1","データ種別",null,null,1,"9",2,null,"○"]
[null,null,"100",null,"温度管理区分",null,"X",1,null,null,"該当商品の温度帯管理区",null,null,null,null,null,"△/0:常温\n1:28℃以下\n2:20℃以下\n\n","3:冷蔵(10℃以下)\n4:冷凍(-15℃\n                 以下)",null,"ｺｰﾄﾞ",null,"○","属性初期値","◎",null,null,"","","","",null,"2","送信先コード",null,null,3,"9",8,null,"○"]
[null,null,"101",null,"製品容器区分",null,9,1,null,null,"該当商品の製品・容器かを指定",null,null,null,null,null,"0:製品","1:容器",null,"ｺｰﾄﾞ",null,"○","属性初期値","◎",null,null,"","","","",null,"3","送信元コード",null,null,11,"9",8,null,"○"]
[null,null,"102","   ③ トレーラレコード","外箱GTIN(ITF)コード",null,"X",14,null,null,"実際に入庫する外箱のＩＴＦコードを指定する",null,null,null,null,null,null,null,null,null,null,"○","属性初期値","◎",null,null,"","","","",null,"4","レコード区分",null,null,19,"9",1,null,"○"]
[null,null,"103",null,"摘要",null,"X/N",50,null,null,"任意使用",null,"(英数カナは50文字、漢字は25文字)",null,null,null,null,null,null,null,null,"○","属性初期値","◎",null,null,"","","","",null,"5","レコード件数",null,null,20,"9",6,null,"○"]
[null,null,"104",null,"日本語区分（商品名）",null,"X",1,null,null,"該当項目の日本語区分",null,null,null,null,null,"△/0:英数カナ\n1:　　漢字(S-JIS/JIS/JEF/IBM)",null,null,"ｺｰﾄﾞ",null,"○","属性初期値","◎",null,null,"","","","",null,"6","伝票枚数",null,null,26,"9",6]
[null,null,"105",null,"日本語区分（摘要）",null,"X",1,null,null,"　　〃 ",null,null,null,null,null,"　　〃 ",null,null,"ｺｰﾄﾞ",null,"○","属性初期値","◎",null,null,"","","","",null,"7","合計金額符号",null,null,32,"X",1]
[null,null,"106",null,"菓子業界商品分類コード",null,"X",6,null,null,"菓子業界の新商品分類コード",null,"(JICFSの機能分類コードとして登録)",null,null,null,null,null,null,null,null,"○","属性初期値","◎",null,null,"","","","",null,"8","合計金額",null,null,33,"9",10]
[null,null,"107",null,"割戻1","割戻計算区分","X",1,null,null,null,null,"(未使用)",null,null,null,null,null,null,null,null,"○","属性初期値","◎",null,null,"","","",""]
[null,null,"108",null,null,"割戻区分","X",1,null,null,null,null,"(未使用)",null,null,null,null,null,null,null,null,"○","属性初期値","◎",null,null,"","","",""]
[null,null,"109",null,null,"割戻基準","X",1,null,null,null,null,"(未使用)",null,null,null,null,null,null,null,null,"○","属性初期値","◎",null,null,"","","",""]
[null,null,"110",null,null,"割戻率／単価",9,4,2,null,null,null,"(未使用)",null,null,null,null,null,null,null,null,"○","属性初期値","◎",null,null,"","","",""]
[null,null,"111",null,null,"割戻金額符号","X",1,null,null,null,null,"(未使用)",null,null,null,null,null,null,null,null,"○","属性初期値","◎",null,null,"","","",""]
[null,null,"112",null,null,"割戻金額",9,8,null,null,null,null,"(未使用)",null,null,null,null,null,null,null,null,"○","属性初期値","◎",null,null,"","","",""]
[null,null,"113",null,null,"割戻コード","X",5,null,null,null,null,"(未使用)",null,null,null,null,null,null,null,null,"○","属性初期値","◎",null,null,"","","",""]
[null,null,"114",null,"割戻2","割戻計算区分","X",1,null,null,null,null,"(未使用)",null,null,null,null,null,null,null,null,"○","属性初期値","◎",null,null,"","","",""]
[null,null,"115",null,null,"割戻区分","X",1,null,null,null,null,"(未使用)",null,null,null,null,null,null,null,null,"○","属性初期値","◎",null,null,"","","",""]
[null,null,"116",null,null,"割戻基準","X",1,null,null,null,null,"(未使用)",null,null,null,null,null,null,null,null,"○","属性初期値","◎",null,null,"","","",""]
[null,null,"117",null,null,"割戻率／単価",9,4,2,null,null,null,"(未使用)",null,null,null,null,null,null,null,null,"○","属性初期値","◎",null,null,"","","",""]
[null,null,"118",null,null,"割戻金額符号","X",1,null,null,null,null,"(未使用)",null,null,null,null,null,null,null,null,"○","属性初期値","◎",null,null,"","","",""]
[null,null,"119",null,null,"割戻金額",9,8,null,null,null,null,"(未使用)",null,null,null,null,null,null,null,null,"○","属性初期値","◎",null,null,"","","",""]
[null,null,"120",null,null,"割戻コード","X",5,null,null,null,null,"(未使用)",null,null,null,null,null,null,null,null,"○","属性初期値","◎",null,null,"","","",""]
[null,null,"121",null,"割戻3","割戻計算区分","X",1,null,null,null,null,"(未使用)",null,null,null,null,null,null,null,null,"○","属性初期値","◎",null,null,"","","",""]
[null,null,"122",null,null,"割戻区分","X",1,null,null,null,null,"(未使用)",null,null,null,null,null,null,null,null,"○","属性初期値","◎",null,null,"","","",""]
[null,null,"123",null,null,"割戻基準","X",1,null,null,null,null,"(未使用)",null,null,null,null,null,null,null,null,"○","属性初期値","◎",null,null,"","","",""]
[null,null,"124",null,null,"割戻率／単価",9,4,2,null,null,null,"(未使用)",null,null,null,null,null,null,null,null,"○","属性初期値","◎",null,null,"","","",""]
[null,null,"125",null,null,"割戻金額符号","X",1,null,null,null,null,"(未使用)",null,null,null,null,null,null,null,null,"○","属性初期値","◎",null,null,"","","",""]
[null,null,"126",null,null,"割戻金額",9,8,null,null,null,null,"(未使用)",null,null,null,null,null,null,null,null,"○","属性初期値","◎",null,null,"","","",""]
[null,null,"127",null,null,"割戻コード","X",5,null,null,null,null,"(未使用)",null,null,null,null,null,null,null,null,"○","属性初期値","◎",null,null,"","","",""]
[null,null,"128",null,"明細連携エリア",null,"X",10,null,null,"旧フォーマット予備連携データ",null,"(新フォーマット間：相対利用可能エリア)",null,null,null,null,null,null,null,null,"○","○","◎",null,"24",{"$f":"IF($Z170=\"\",\"\",VLOOKUP($Z170,$AF$94:$AN$119,3,))","v":"予備１"},{"$f":"IF($Z170=\"\",\"\",VLOOKUP($Z170,$AF$94:$AN$119,6,))","v":"X"},{"$f":"IF($Z170=\"\",\"\",VLOOKUP($Z170,$AF$94:$AN$119,7,))","v":3},{"$f":"IF($Z170=\"\",\"\",VLOOKUP($Z170,$AF$94:$AN$119,8,))","v":0}]
[null,1.8,"129","レコード件数",null,null,9,6,null,"○","レコードの総件数\n・データ送信側では、自身のフォーマットのレコード件数を設定する。\n・データ受信側では、当項目と実際のレコード件数の整合性チェックには利用しない。※下記【トレーラレコード連携時の留意事項】を参照のこと\n",null,null,null,null,null,null,null,"属性＋桁数","属性","センタチェック","※ センター集計値","　　※ センター集計値",null,null,"5",{"$f":"IF($Z171=\"\",\"\",VLOOKUP($Z171,$AF$145:$AN$148,2,))","v":"レコード件数"},{"$f":"IF($Z171=\"\",\"\",VLOOKUP($Z171,$AF$145:$AN$148,6,))","v":"9"},{"$f":"IF($Z171=\"\",\"\",VLOOKUP($Z171,$AF$145:$AN$148,7,))","v":6},{"$f":"IF($Z171=\"\",\"\",VLOOKUP($Z171,$AF$145:$AN$148,8,))","v":0}]
[null,null,"130","伝票枚数",null,null,9,6,null,null,"伝票枚数",null,null,null,null,null,null,null,"属性＋桁数","属性","と同じ","※ センター集計値","　　※ センター集計値",null,null,"6",{"$f":"IF($Z172=\"\",\"\",VLOOKUP($Z172,$AF$145:$AN$148,2,))","v":"伝票枚数"},{"$f":"IF($Z172=\"\",\"\",VLOOKUP($Z172,$AF$145:$AN$148,6,))","v":"9"},{"$f":"IF($Z172=\"\",\"\",VLOOKUP($Z172,$AF$145:$AN$148,7,))","v":6},{"$f":"IF($Z172=\"\",\"\",VLOOKUP($Z172,$AF$145:$AN$148,8,))","v":0}]
[null,null,"131","合計金額符号",null,null,"X",1,null,null,"合計金額の符号",null,null,null,null,null,"△/＋:正数","－:負数","属性","ｺｰﾄﾞ",null,"※ センター設定　 ","　　※ センター設定　 ","○","コード","7",{"$f":"IF($Z173=\"\",\"\",VLOOKUP($Z173,$AF$145:$AN$148,2,))","v":"合計金額符号"},{"$f":"IF($Z173=\"\",\"\",VLOOKUP($Z173,$AF$145:$AN$148,6,))","v":"X"},{"$f":"IF($Z173=\"\",\"\",VLOOKUP($Z173,$AF$145:$AN$148,7,))","v":1},{"$f":"IF($Z173=\"\",\"\",VLOOKUP($Z173,$AF$145:$AN$148,8,))","v":0}]
[null,null,"132","合計金額",null,null,9,10,null,null,"卸店入金額の全明細行の金額合計",null,null,null,null,null,null,null,"属性＋桁数","属性",null,"※ センター集計値","　　※ センター集計値",null,null,"8",{"$f":"IF($Z174=\"\",\"\",VLOOKUP($Z174,$AF$145:$AN$148,2,))","v":"合計金額"},{"$f":"IF($Z174=\"\",\"\",VLOOKUP($Z174,$AF$145:$AN$148,6,))","v":"9"},{"$f":"IF($Z174=\"\",\"\",VLOOKUP($Z174,$AF$145:$AN$148,7,))","v":10},{"$f":"IF($Z174=\"\",\"\",VLOOKUP($Z174,$AF$145:$AN$148,8,))","v":0}]
[null,null,"133","連携エリア",null,null,"X",20,null,null,"新フォーマット間：相対利用可能エリア",null,null,null,null,null,null,null,null,null,null,"○","属性初期値","◎",null,null,{"$f":"IF($Z175=\"\",\"\",VLOOKUP($Z175,$AF$145:$AN$148,2,))","v":""},{"$f":"IF($Z175=\"\",\"\",VLOOKUP($Z175,$AF$145:$AN$148,6,))","v":""},{"$f":"IF($Z175=\"\",\"\",VLOOKUP($Z175,$AF$145:$AN$148,7,))","v":""},{"$f":"IF($Z175=\"\",\"\",VLOOKUP($Z175,$AF$145:$AN$148,8,))","v":""}]
[null,null,"134","一次店カナ名",null,null,"X",30,null,null,"一次店カナ名",null,"(一次店名 に漢字を設定する場合、必須)",null,null,null,null,null,null,null,null,"○","属性初期値","◎"]
[null,null,"135","二次店カナ名",null,null,"X",30,null,null,"二次店カナ名",null,"(二次店名 に漢字を設定する場合、必須)",null,null,null,null,null,null,null,null,"○","属性初期値","◎"]
[null,null,"136","届け先カナ名",null,null,"Ｘ","30",null,null,"届け先カナ名",null,"(届け先名  に漢字を設定する場合、必須)",null,null,null,null,null,null,null,null,"○","属性初期値","◎",null,null,{"$f":"IF($Z178=\"\",\"\",VLOOKUP($Z178,$AF$17:$AN$37,2,))","v":""},{"$f":"IF($Z178=\"\",\"\",VLOOKUP($Z178,$AF$17:$AN$37,6,))","v":""},{"$f":"IF($Z178=\"\",\"\",VLOOKUP($Z178,$AF$17:$AN$37,7,))","v":""},{"$f":"IF($Z178=\"\",\"\",VLOOKUP($Z178,$AF$17:$AN$37,8,))","v":""}]
[null,null,"137","摘要カナ",null,null,"Ｘ","30",null,null,"摘要カナ",null,"(摘要        に漢字を設定する場合、必須)",null,null,null,null,null,null,null,null,"○","属性初期値","◎",null,null,{"$f":"IF($Z179=\"\",\"\",VLOOKUP($Z179,$AF$17:$AN$37,2,))","v":""},{"$f":"IF($Z179=\"\",\"\",VLOOKUP($Z179,$AF$17:$AN$37,6,))","v":""},{"$f":"IF($Z179=\"\",\"\",VLOOKUP($Z179,$AF$17:$AN$37,7,))","v":""},{"$f":"IF($Z179=\"\",\"\",VLOOKUP($Z179,$AF$17:$AN$37,8,))","v":""}]
[null,null,"138","商品名カナ",null,null,"X","25",null,null,"商品名カナ",null,"(商品名に 漢字を設定する場合、必須)",null,null,null,null,null,null,null,null,"○","属性初期値","◎",null,null,{"$f":"IF($Z180=\"\",\"\",VLOOKUP($Z180,$AF$94:$AN$111,3,))","v":""},{"$f":"IF($Z180=\"\",\"\",VLOOKUP($Z180,$AF$94:$AN$111,6,))","v":""},{"$f":"IF($Z180=\"\",\"\",VLOOKUP($Z180,$AF$94:$AN$111,7,))","v":""},{"$f":"IF($Z180=\"\",\"\",VLOOKUP($Z180,$AF$94:$AN$111,8,))","v":""}]
[null,null,"139","改行コード",null,null,"X","2",null,null,"S-JISの改行コードを設定",null,null,null,null,null,null,null,null,null,null,null,null,null,null,null,{"$f":"IF($Z181=\"\",\"\",VLOOKUP($Z181,$AG$129:$AO$133,2,))","v":""},{"$f":"IF($Z181=\"\",\"\",VLOOKUP($Z181,$AG$129:$AO$133,6,))","v":""},{"$f":"IF($Z181=\"\",\"\",VLOOKUP($Z181,$AG$129:$AO$133,7,))","v":""},{"$f":"IF($Z181=\"\",\"\",VLOOKUP($Z181,$AG$129:$AO$133,8,))","v":""}]
[null,null,null,null,null,null,null,null,null,null,null,null,null,null,null,null,null,null,null,null,null,"※ 配信分割時",null,null,null,null,{"$f":"IF($Z182=\"\",\"\",VLOOKUP($Z182,$AF$145:$AN$148,2,))","v":""},{"$f":"IF($Z182=\"\",\"\",VLOOKUP($Z182,$AF$145:$AN$148,6,))","v":""},{"$f":"IF($Z182=\"\",\"\",VLOOKUP($Z182,$AF$145:$AN$148,7,))","v":""},{"$f":"IF($Z182=\"\",\"\",VLOOKUP($Z182,$AF$145:$AN$148,8,))","v":""}]
[null,null,null,null,null,null,null,null,null,null,null,null,null,null,null,null,null,null,null,null,null,null,null,null,null,null,{"$f":"IF($Z183=\"\",\"\",VLOOKUP($Z183,$AF$145:$AN$148,2,))","v":""},{"$f":"IF($Z183=\"\",\"\",VLOOKUP($Z183,$AF$145:$AN$148,6,))","v":""},{"$f":"IF($Z183=\"\",\"\",VLOOKUP($Z183,$AF$145:$AN$148,7,))","v":""},{"$f":"IF($Z183=\"\",\"\",VLOOKUP($Z183,$AF$145:$AN$148,8,))","v":""}]
[null,null,null,null,null,null,null,null,null,null," ※ファイルの形式は、カンマ区切りの可変長形式となります。各項目の値にダブルクォート「\"」の囲みは不要です。"]
[null,null,null,null,null,null,null,null,null,null," ※画面から受信（ダウンロード）したファイルの最終行にはエンドレコードが出力されます。"]
[null,null,null,null,null,null,null,null,null,null,"　  エンドレコードのレイアウトは「エンドレコード」を参照してください。"]
[null,null,null,null,null,null,null,null,null,null," ※画面から送信（アップロード）するファイルにエンドレコードは不要です。"]

{"sheet":"１８返品通知","index":11,"n_rows":127,"n_cols":40,"rows_kept":127,"cut":false,"hidden":false,"merged":[[107,36,108,36],[107,37,108,37],[107,38,108,38],[107,39,108,39],[17,36,18,36],[17,37,18,37],[17,38,18,38],[17,39,18,39],[75,39,76,39],[75,36,76,36],[75,37,76,37],[75,38,76,38],[3,1,4,1],[3,2,4,2],[3,3,4,4],[3,6,4,6],[3,7,4,7],[3,36,4,36],[3,37,4,37],[3,38,4,38],[3,39,4,39],[3,8,4,8],[3,9,4,9],[3,10,4,10],[3,16,4,16],[3,23,3,27],[3,31,4,31],[4,23,4,24],[3,32,4,33],[3,35,4,35],[17,31,18,31],[17,32,18,33],[17,35,18,35],[67,23,67,27],[75,31,76,31],[75,32,76,33],[75,35,76,35],[68,23,68,24],[45,16,45,17],[50,16,50,17],[57,16,57,17],[109,10,109,15],[105,16,105,17],[80,16,80,17],[107,31,108,31],[107,32,108,33],[107,35,108,35],[59,16,59,17],[69,16,69,17],[67,9,68,9],[67,10,68,10],[67,16,68,16],[67,8,68,8],[67,1,68,1],[67,2,68,2],[67,3,68,4],[67,6,68,6],[67,7,68,7]]}
[null,null,null,null,null,null,null,null,null,null,null,null,null,null,null,null,null,null,null,null,null,null,null,null,null,null,null,null,null,null,null,{"$f":"シート別総ページ数","v":{"$error":"#NAME?"}}]
[null,null,"（４）Ｖ２・１８返品通知"]
[null,null,"　",null,null,null,null,null,null,null,null,null,null,null,null,null,null,null,null,null,null,null,null,null,null,null,null,null,null,null,null,"　","   ① コントロールレコード"]
[null,"変更","項番","　項目",null,null,"属性","整数桁","小数桁","必須","　項目説明",null,null,null,null,null,"　コード",null,"アップロード","V２ → Ｖ１･Ｖ２","Ｖ２→ Ｖ１","Ｖ２ ← Ｖ２","Ｖ２ ← Ｖ１","　　　　　　　Ｖ１フォーマット",null,null,null,null,null,null,null,"項番","　項目",null,null,"開始位置","属性","整数桁","小数桁","必須"]
[null,null,null,null,null,null,null,null,null,null,null,null,null,null,null,null,null,null,"チェック","センタチェック","センタチェック","コンバート","コンバート","比較・  変更点",null,"項番","　　項目","属性","整数","小数"]
[null,null,"1","データ種別",null,null,9,2,null,"◎","１８：返品通知データ",null,null,null,null,null,"18",null,"必須","ｺｰﾄﾞ",null,"○","\"18\"固定","○","ｺｰﾄﾞ",null,{"$f":"IF($Z6=\"\",\"\",VLOOKUP($Z6,$AF$6:$AN$19,2,))","v":""},{"$f":"IF($Z6=\"\",\"\",VLOOKUP($Z6,$AF$6:$AN$19,6,))","v":""},{"$f":"IF($Z6=\"\",\"\",VLOOKUP($Z6,$AF$6:$AN$19,7,))","v":""},{"$f":"IF($Z6=\"\",\"\",VLOOKUP($Z6,$AF$6:$AN$19,8,))","v":""},null,"1","データ種別",null,null,1,"9",2,null,"○"]
[null,null,"2","最終トレーラ判定区分",null,null,"X",1,null,"◎","トレーラ判定の区分",null,null,null,null,null,"9:最終","△:それ以外",null,"ｺｰﾄﾞ",null,"○","9:最終、△:それ以外",null,null,null,"","","",""]
[null,null,"３","送信先コード",null,null,9,8,null,"◎","送信先(メーカ)","の統一取引先コード",null,null,null,null,null,null,"必須＋属性＋桁数＋登録","センター登録",null,"○","○",null,null,"2","送信先コード","9",8,0,null,"2","送信先コード",null,null,3,"9",8,null,"○"]
[null,null,"４","送信元コード",null,null,9,8,null,"◎","送信元(卸)     ","の統一取引先コード",null,null,null,null,null,null,"必須＋属性＋桁数＋登録","センター登録",null,"○","○",null,null,"3","送信元コード","9",8,0,null,"3","送信元コード",null,null,11,"9",8,null,"○"]
[null,null,"5","データ作成日",null,null,9,8,null,"◎","データ作成日付",null,"(西暦 YYYYMMDD)",null,null,null,null,null,null,"必須＋日付","センタチェック","○","○",null,null,"5","データ作成日","9",8,0,null,"5","データ作成日",null,null,20,"9",8,null,"○"]
[null,null,"6","データ作成時刻",null,null,9,6,null,null,"データ作成時刻",null,"(HHMMSS)",null,null,null,null,null,null,"時刻","と同じ","○","属性初期値","◎",null,null,"","","","",null,"6","送信先名",null,null,28,"X",20,null,"○"]
[null,null,"7","送信先名",null,null,"X",20,null,"○","送信先(メーカ)名          ",null,"(英数カナのみ)",null,null,null,null,null,"属性",null,null,"○","○",null,null,"6","送信先名","X",20,0,null,"7","送信元名",null,null,48,"X",20,null,"○"]
[null,null,"8","送信元名",null,null,"X",20,null,"◎","送信元(卸)名 　          　",null,"(英数カナのみ)",null,null,null,null,null,"属性","必須",null,"○","○",null,null,"7","送信元名","X",20,0,null,"8","直接送信先コード",null,null,68,"9",8]
[null,null,"9","直接送信先コード",null,null,9,8,null,null,"送信先コードと異なる場合にセット          ",null,"(通常はゼロ)",null,null,null,null,null,null,"センター登録",null,"○","○",null,null,"8","直接送信先コード","9",8,0,null,"9","直接送信先カナ名",null,null,76,"X",20]
[null,null,"10","直接送信先名",null,null,"X",20,null,null,"直接送信先名",null,"(英数カナのみ、通常はスペース)",null,null,null,null,null,"属性",null,null,"○","○",null,null,"9","直接送信先カナ名","X",20,0,null,"10","予備",null,null,96,"X",161]
[null,null,"11","送信ファイルNO",null,null,9,2,null,null,"同時送信時の問合せ№",null,"(00～99)",null,null,null,null,null,null,"属性",null,"○","属性初期値","◎",null,null,"","","",""]
[null,null,"12","連携エリア",null,null,"X",20,null,null,"新フォーマット間：相対利用可能エリア",null,null,null,null,null,null,null,null,null,null,"○","属性初期値","◎",null,null,"","","","",null,null,"   ② ヘッダーレコード"]
[null,null,"13","卸発注伝票NO",null,null,9,8,null,"○","受発注データの卸伝票№",null,"(6桁→8桁に拡張、6桁運用の時は上２桁ゼロ埋め）",null,null,null,null,null,"必須＋属性＋桁数","属性",null,"○","予備上2桁(不正時\"00\")\n＋卸伝票NO","○","桁数","23\n5","予備\n卸伝票NO","X\n9","29\n6",0,null,"項番","　項目",null,null,"開始位置","属性","整数桁","小数桁","必須"]
[null,null,"14","店入直送区分",null,null,9,1,null,null,"店(倉)入れまたは直送等の区分",null,null,null,null,null,"1:店入\n2:直送\n","3:店引取\n4:直送引取",null,"ｺｰﾄﾞ",null,"○","○","○","ｺｰﾄﾞ","6",{"$f":"IF($Z19=\"\",\"\",VLOOKUP($Z19,$AF$20:$AN$42,2,))","v":"店入直送区分"},{"$f":"IF($Z19=\"\",\"\",VLOOKUP($Z19,$AF$20:$AN$42,6,))","v":"9"},{"$f":"IF($Z19=\"\",\"\",VLOOKUP($Z19,$AF$20:$AN$42,7,))","v":1},{"$f":"IF($Z19=\"\",\"\",VLOOKUP($Z19,$AF$20:$AN$42,8,))","v":0}]
[null,2.7,"15","取引コード",null,null,9,2,null,"○","業界統一取引コード",null,null,null,null,null,"11:店入売上\n12:店入売上訂正\n21:店入返品\n22:店入返品訂正\n31:直送売上\n32:直送売上訂正\n\n\n\n","41:直送返品\n42:直送返品訂正\n51:割戻し金\n52:相殺\n81:ﾒｰｶｰ提供の役務\n91:卸提供の役務",null,"ｺｰﾄﾞ",null,"○","○",null,null,"7",{"$f":"IF($Z20=\"\",\"\",VLOOKUP($Z20,$AF$20:$AN$42,2,))","v":"取引コード"},{"$f":"IF($Z20=\"\",\"\",VLOOKUP($Z20,$AF$20:$AN$42,6,))","v":"9"},{"$f":"IF($Z20=\"\",\"\",VLOOKUP($Z20,$AF$20:$AN$42,7,))","v":2},{"$f":"IF($Z20=\"\",\"\",VLOOKUP($Z20,$AF$20:$AN$42,8,))","v":0},null,"1","データ種別",null,null,1,"9",2,null,"○"]
[null,null,"16","返品日",null,null,9,8,null,"◎","返品処理日",null,"(西暦 YYYYMMDD)",null,null,null,null,null,"属性＋桁数","必須＋日付",null,"○","○",null,null,"8","返品日","9",8,0,null,"2","送信先コード",null,null,3,"9",8,null,"○"]
[null,null,"17","納入時間（自）",null,null,9,4,null,null,null,null,"(未使用)",null,null,null,null,null,null,null,null,"○","属性初期値","◎",null,null,"","","","",null,"3","送信元コード",null,null,11,"9",8,null,"○"]
[null,null,"18","納入時間（至）",null,null,9,4,null,null,null,null,"(未使用)",null,null,null,null,null,null,null,null,"○","属性初期値","◎",null,null,"","","","",null,"4","レコード区分",null,null,19,"9",1,null,"○"]
[null,null,"19","発注日",null,null,9,8,null,null,null,null,"(未使用)",null,null,null,null,null,null,null,null,"○","属性初期値","◎",null,null,"","","","",null,"5","卸伝票NO",null,null,20,"9",6,null,"○"]
[null,null,"20","明細行数",null,null,9,2,null,null,"伝票内明細数",null,null,null,null,null,"00～06",null,null,"ｺｰﾄﾞ",null,"○","○",null,null,"9","明細行数","9",2,0,null,"6","店入直送区分",null,null,26,"9",1]
[null,null,"21","一次店コード",null,null,"X",13,null,"◎","統一取引先コード(8桁)",null,null,null,"(後方スペース埋め)",null,null,null,"桁数","必須",null,"○","前詰８桁＋空白５桁","○","属性＋桁数","10","一次店コード","9",8,0,null,"7","取引コード",null,null,27,"9",2,null,"○"]
[null,null,"22","二次店コード",null,null,"X",13,null,null,"統一取引先コード(8桁)",null,null,null,"(後方スペース埋め)",null,null,null,"桁数",null,null,"○","前詰８桁＋空白５桁","○","属性＋桁数","11","二次店コード","9",8,0,null,"8","返品日",null,null,29,"9",8,null,"○"]
[null,null,"23","三次店コード",null,null,"X",13,null,null,"統一取引先コード(8桁)／プライベート・コード(3～8桁)／ＧＬＮ(13桁)",null,null,null,"(後方スペース埋め)",null,null,null,"桁数",null,null,"○","属性初期値","◎",null,null,"","","","",null,"9","明細行数",null,null,37,"9",2,null,"○"]
[null,null,"24","届け先コード",null,null,"X",13,null,null,"統一取引先コード(8桁)",null,null,null,"(後方スペース埋め)",null,null,null,"桁数",null,null,"○","前詰８桁＋空白５桁","○","属性＋桁数","12","届け先コード","9",8,0,null,"10","一次店コード",null,null,39,"9",8]
[null,null,"25","チェーン店コード",null,null,"X",13,null,null,"統一取引先コード(8桁)／プライベート・コード(3～8桁)／ＧＬＮ(13桁)",null,null,null,"(後方スペース埋め)",null,null,null,"桁数",null,null,"○","属性初期値","◎",null,null,"","","","",null,"11","二次店コード",null,null,47,"9",8]
[null,null,"26","専用伝票日付",null,null,9,8,null,null,"納品伝票が専用伝票の場合にセット",null,"(西暦 YYYYMMDD)",null,null,null,null,null,null,"日付",null,"○","○",null,null,"13","専用伝票日付","9",8,0,null,"12","届け先コード",null,null,55,"9",8]
[null,null,"27","専用伝票NO",null,null,9,9,null,null,"　　〃              　　　　    ",null,"(専用伝票№、左ゼロ埋め)",null,null,null,null,null,null,"属性",null,"○","○",null,null,"14","専用伝票NO","9",9,0,null,"13","専用伝票日付",null,null,63,"9",8]
[null,null,"28","伝票合計金額符号",null,null,"X",1,null,"○","伝票の合計金額の符号",null,null,null,null,null,"△/＋:正数","－:負数","属性","ｺｰﾄﾞ",null,"○","○","○","ｺｰﾄﾞ","15","伝票合計金額符号","X",1,0,null,"14","専用伝票NO",null,null,71,"9",9]
[null,null,"29","伝票合計金額",null,null,9,8,null,"○","伝票の合計金額",null,"(卸店入価格、１億円未満)",null,null,null,null,null,"属性＋桁数","属性",null,"○","○",null,null,"16","伝票合計金額","9",8,0,null,"15","伝票合計金額符号",null,null,80,"X",1,null,"○"]
[null,null,"30","二次店納入合計金額符号",null,null,"X",1,null,null,"正味納入合計金額の符号",null,null,null,null,null,"△/＋:正数","－:負数","属性","ｺｰﾄﾞ",null,"○","属性初期値","◎",null,null,"","","","",null,"16","伝票合計金額",null,null,81,"9",8,null,"○"]
[null,null,"31","二次店納入合計金額",null,null,9,8,null,null,"正味納入合計金額",null,"(二次店納入価格、１億円未満）",null,null,null,null,null,"属性＋桁数","属性",null,"○","属性初期値","◎",null,null,"","","","",null,"17","一次店カナ名",null,null,89,"X",30]
[null,null,"32","一次店名",null,null,"X/N",40,null,null,"一次店名",null,"(英数カナは30文字、漢字は20文字)",null,null,null,null,null,null,null,null,"○","○","○","属性＋桁数","17","一次店カナ名","X",30,0,null,"18","二次店カナ名",null,null,119,"X",30]
[null,null,"33","二次店名",null,null,"X/N",40,null,null,"二次店名",null,"(英数カナは30文字、漢字は20文字)",null,null,null,null,null,null,null,null,"○","○","○","属性＋桁数","18","二次店カナ名","X",30,0,null,"19","届け先カナ名",null,null,149,"X",30]
[null,null,"34","三次店名",null,null,"X/N",40,null,null,"三次店名",null,"(英数カナは30文字、漢字は20文字)",null,null,null,null,null,null,null,null,"○","属性初期値","◎",null,null,"","","","",null,"20","メーカ所属組織名",null,null,179,"X",10]
[null,null,"35","届け先名",null,null,"X/N",40,null,null,"届け先名",null,"(英数カナは30文字、漢字は20文字)",null,null,null,null,null,null,null,null,"○","○","○","属性＋桁数","19","届け先カナ名","X",30,0,null,"21","摘要欄",null,null,189,"X",30]
[null,null,"36","チェーン店名",null,null,"X/N",40,null,null,"チェーン店名",null,"(英数カナは30文字、漢字は20文字)",null,null,null,null,null,null,null,null,"○","属性初期値","◎",null,null,"","","","",null,"22","メーカコード",null,null,219,"X",9,null,"○"]
[null,null,"37","電話番号",null,null,"X",15,null,null,"通常は届け先の電話番号  ",null,"(局番区切り(-)あり)",null,null,null,null,null,null,null,null,"○","属性初期値","◎",null,null,"","","","",null,"23","予備",null,null,228,"X",29]
[null,null,"38","住所",null,null,"X/N",80,null,null,"通常は届け先の住所         ",null,"(英数カナは60文字、漢字は40文字)",null,null,null,null,null,null,null,null,"○","属性初期値","◎",null,null,"","","",""]
[null,null,"39","メーカコード",null,null,"X",9,null,"○","７桁の場合は後ろスペース",null,"(49xxxxx / 45xxxxxxx)",null,null,null,null,null,"属性",null,null,"○","○",null,null,"22","メーカコード","X",9,0]
[null,null,"40","メーカ所属組織名",null,null,"X",10,null,null,"メーカの担当所属の組織名(英数カナ)を指定、実質スペース運用が多い",null,null,null,null,null,null,null,"属性",null,null,"○","○",null,null,"20","メーカ所属組織名","X",10,0]
[null,null,"41","伝票区分",null,null,9,1,null,null,null,null,"(未使用)",null,null,null,null,null,null,null,null,"○","属性初期値","◎",null,null,"","","",""]
[null,null,"42","定番特売区分",null,null,"X",1,null,null,null,null,"(未使用)",null,null,null,null,null,null,null,null,"○","属性初期値","◎",null,null,"","","",""]
[null,null,"43","ロット不足運賃負担区分",null,null,"X",1,null,null,null,null,"(未使用)",null,null,null,null,null,null,null,null,"○","属性初期値","◎",null,null,"","","",""]
[null,null,"44","下請法",null,"伝票表示区分","X",1,null,null,null,null,"(未使用)",null,null,null,null,null,null,null,null,"○","属性初期値","◎",null,null,"","","",""]
[null,null,"45",null,null,"伝票表示内容","X/N",80,null,null,null,null,"(未使用)",null,null,null,null,null,null,null,null,"○","属性初期値","◎",null,null,"","","",""]
[null,null,"46",null,null,"日本語区分（表示）","X",1,null,null,null,null,"(未使用)",null,null,null,null,null,null,null,null,"○","属性初期値","◎",null,null,"","","",""]
[null,null,"47",null,null,"支払期限",9,8,null,null,null,null,"(未使用)",null,null,null,null,null,null,null,null,"○","属性初期値","◎",null,null,"","","",""]
[null,null,"48","消費税区分",null,null,"X",1,null,null,"税区分",null,null,null,null,null,"1:外税\n2:内税\n","3:非課税\n△:個別判断",null,"ｺｰﾄﾞ",null,"○","属性初期値","◎",null,null,"","","",""]
[null,null,"49","消費税率",null,null,9,2,1,null,"消費税の税率(99.9％)、ゼロ:個別判断　",null,null,"(小数点以下1桁)",null,null,null,null,"属性＋桁数","属性",null,"○","属性初期値","◎",null,null,"","","",""]
[null,null,"50","摘要",null,null,"X/N",50,null,null,"伝票の摘要欄の内容（英数カナは50文字、漢字は25文字）",null,null,null,null,null,null,null,null,null,null,"○","○","○","属性＋桁数","21","摘要欄","X",30,0]
[null,null,"51","取引先区分（一次店）",null,null,"X",1,null,null,"該当項目の取引先の属性区分",null,null,null,null,null,"△:統一取引先(8桁)",null,null,"ｺｰﾄﾞ",null,"○","属性初期値","◎",null,null,{"$f":"IF($Z56=\"\",\"\",VLOOKUP($Z56,$AF$21:$AN$33,2,))","v":""},{"$f":"IF($Z56=\"\",\"\",VLOOKUP($Z56,$AF$21:$AN$33,6,))","v":""},{"$f":"IF($Z56=\"\",\"\",VLOOKUP($Z56,$AF$21:$AN$33,7,))","v":""},{"$f":"IF($Z56=\"\",\"\",VLOOKUP($Z56,$AF$21:$AN$33,8,))","v":""}]
[null,null,"52","取引先区分（二次店）",null,null,"X",1,null,null,"　　〃 ",null,null,null,null,null,"△:統一取引先(8桁)",null,null,"ｺｰﾄﾞ",null,"○","属性初期値","◎",null,null,{"$f":"IF($Z57=\"\",\"\",VLOOKUP($Z57,$AF$21:$AN$33,2,))","v":""},{"$f":"IF($Z57=\"\",\"\",VLOOKUP($Z57,$AF$21:$AN$33,6,))","v":""},{"$f":"IF($Z57=\"\",\"\",VLOOKUP($Z57,$AF$21:$AN$33,7,))","v":""},{"$f":"IF($Z57=\"\",\"\",VLOOKUP($Z57,$AF$21:$AN$33,8,))","v":""}]
[null,null,"53","取引先区分（三次店）",null,null,"X",1,null,null,"　　〃 ",null,null,null,null,null,"△:  統一取引先(8桁)\n6:   GLN(13桁)\n7/8:プライベートコード(卸/ﾒｰｶ)",null,null,"ｺｰﾄﾞ",null,"○","属性初期値","◎",null,null,{"$f":"IF($Z58=\"\",\"\",VLOOKUP($Z58,$AF$21:$AN$33,2,))","v":""},{"$f":"IF($Z58=\"\",\"\",VLOOKUP($Z58,$AF$21:$AN$33,6,))","v":""},{"$f":"IF($Z58=\"\",\"\",VLOOKUP($Z58,$AF$21:$AN$33,7,))","v":""},{"$f":"IF($Z58=\"\",\"\",VLOOKUP($Z58,$AF$21:$AN$33,8,))","v":""}]
[null,null,"54","取引先区分（届け先）",null,null,"X",1,null,null,"　　〃 ",null,null,null,null,null,"△:統一取引先(8桁)",null,null,"ｺｰﾄﾞ",null,"○","属性初期値","◎",null,null,{"$f":"IF($Z59=\"\",\"\",VLOOKUP($Z59,$AF$21:$AN$33,2,))","v":""},{"$f":"IF($Z59=\"\",\"\",VLOOKUP($Z59,$AF$21:$AN$33,6,))","v":""},{"$f":"IF($Z59=\"\",\"\",VLOOKUP($Z59,$AF$21:$AN$33,7,))","v":""},{"$f":"IF($Z59=\"\",\"\",VLOOKUP($Z59,$AF$21:$AN$33,8,))","v":""}]
[null,null,"55","取引先区分（チェーン店）",null,null,"X",1,null,null,"　　〃 ",null,null,null,null,null,"△:  統一取引先(8桁)\n6:   GLN(13桁)\n7/8:プライベートコード(卸/ﾒｰｶ)",null,null,"ｺｰﾄﾞ",null,"○","属性初期値","◎",null,null,{"$f":"IF($Z60=\"\",\"\",VLOOKUP($Z60,$AF$21:$AN$33,2,))","v":""},{"$f":"IF($Z60=\"\",\"\",VLOOKUP($Z60,$AF$21:$AN$33,6,))","v":""},{"$f":"IF($Z60=\"\",\"\",VLOOKUP($Z60,$AF$21:$AN$33,7,))","v":""},{"$f":"IF($Z60=\"\",\"\",VLOOKUP($Z60,$AF$21:$AN$33,8,))","v":""}]
[null,null,"（次頁に続く）"]
[]
[]
[]
[]
[]
[null,null,"（前頁の続き）"]
[null,"変更","項番","　項目",null,null,"属性","整数桁","小数桁","必須","　項目説明",null,null,null,null,null,"　コード",null,"アップロード","V２ → Ｖ１･Ｖ２","Ｖ２→ Ｖ１","Ｖ２ ← Ｖ２","Ｖ２ ← Ｖ１","　　　　　　　Ｖ１フォーマット"]
[null,null,null,null,null,null,null,null,null,null,null,null,null,null,null,null,null,null,"チェック","センタチェック","センタチェック","コンバート","コンバート","比較・  変更点",null,"項番","　　項目","属性","整数","小数"]
[null,null,"56","日本語区分（一次店）",null,null,"X",1,null,null,"該当項目の日本語区分",null,null,null,null,null,"△/0:英数カナ\n1:　　漢字(S-JIS/JIS/JEF/IBM)",null,null,"ｺｰﾄﾞ",null,"○","属性初期値","◎",null,null,{"$f":"IF($Z70=\"\",\"\",VLOOKUP($Z70,$AF$21:$AN$33,2,))","v":""},{"$f":"IF($Z70=\"\",\"\",VLOOKUP($Z70,$AF$21:$AN$33,6,))","v":""},{"$f":"IF($Z70=\"\",\"\",VLOOKUP($Z70,$AF$21:$AN$33,7,))","v":""},{"$f":"IF($Z70=\"\",\"\",VLOOKUP($Z70,$AF$21:$AN$33,8,))","v":""}]
[null,null,"57","日本語区分（二次店）",null,null,"X",1,null,null,"　　〃 ",null,null,null,null,null,"　　〃 ",null,null,"ｺｰﾄﾞ",null,"○","属性初期値","◎",null,null,"","","",""]
[null,null,"58","日本語区分（三次店）",null,null,"X",1,null,null,"　　〃 ",null,null,null,null,null,"　　〃 ",null,null,"ｺｰﾄﾞ",null,"○","属性初期値","◎",null,null,"","","",""]
[null,null,"59","日本語区分（届け先）",null,null,"X",1,null,null,"　　〃 ",null,null,null,null,null,"　　〃 ",null,null,"ｺｰﾄﾞ",null,"○","属性初期値","◎",null,null,"","","",""]
[null,null,"60","日本語区分（チェーン店）",null,null,"X",1,null,null,"　　〃 ",null,null,null,null,null,"　　〃 ",null,null,"ｺｰﾄﾞ",null,"○","属性初期値","◎",null,null,"","","",""]
[null,null,"61","日本語区分（住所）",null,null,"X",1,null,null,"　　〃 ",null,null,null,null,null,"　　〃 ",null,null,"ｺｰﾄﾞ",null,"○","属性初期値","◎",null,null,"","","","",null,null,"   ③ 明細レコード"]
[null,null,"62","日本語区分（摘要）",null,null,"X",1,null,null,"　　〃 ",null,null,null,null,null,"　　〃 ",null,null,"ｺｰﾄﾞ",null,"○","属性初期値","◎",null,null,"","","","",null,"項番","　項目",null,null,"開始位置","属性","整数桁","小数桁","必須"]
[null,null,"63","ヘッダー連携エリア",null,null,"X",20,null,null,"新フォーマット間：相対利用可能エリア",null,null,null,null,null,null,null,null,null,null,"○","属性初期値","◎",null,null,"","","",""]
[null,null,null,"明細部（４００バイト）　　　　　　　　　　",null,null,null,null,null,null,null,null,null,null,null,null,null,null,null,null,null,null,null,null,null,null,{"$f":"IF($Z78=\"\",\"\",VLOOKUP($Z78,$AF$78:$AN$102,2,))","v":""},{"$f":"IF($Z78=\"\",\"\",VLOOKUP($Z78,$AF$78:$AN$102,6,))","v":""},{"$f":"IF($Z78=\"\",\"\",VLOOKUP($Z78,$AF$78:$AN$102,7,))","v":""},{"$f":"IF($Z78=\"\",\"\",VLOOKUP($Z78,$AF$78:$AN$102,8,))","v":""},null,"1","データ種別",null,null,1,"9",2,null,"○"]
[null,null,"64",null,"明細行NO",null,9,2,null,"◎","伝票内明細数",null,null,null,null,null,"01～06",null,null,"必須＋ｺｰﾄﾞ",null,"○","○","○","名称","5",{"$f":"IF($Z79=\"\",\"\",VLOOKUP($Z79,$AF$78:$AN$102,3,))","v":"行NO"},"9",2,0,null,"2","送信先コード",null,null,3,"9",8,null,"○"]
[null,null,"65",null,"専用伝票行NO",null,9,2,null,null,"専用伝票の行№",null,"(00～99)",null,null,null,null,null,null,"属性",null,"○","○",null,null,"6","専用伝票行NO","9",2,0,null,"3","送信元コード",null,null,11,"9",8,null,"○"]
[null,null,"66",null,"商品コード識別区分",null,9,1,null,"○","品番(商品コード)の識別区分",null,null,null,null,null,"0:統一商品コード\n1:ＩＴＦコード (14桁)\n2:ＩＴＦコード(16桁)  【利用停止化】\n3:JANコード    (標準:13桁)\n4:JANコード    (短縮:8桁)\n6:GTINコード  (14桁)",null,"属性","コード(新)",null,"○","○","○","属性＋コード\n2:利用停止","7","商品コード識別区分","X",1,0,null,"4","レコード区分",null,null,19,"9",1,null,"○"]
[null,null,"67",null,"品番",null,"X",16,null,"○","統一商品ｺｰﾄﾞ､ITFｺｰﾄﾞ､JANｺｰﾄﾞ､GTINｺｰﾄﾞ",null,null,"(左詰め)",null,null,null,null,"属性",null,null,"○","○","○","ITF(16)\n利用停止","8","品番","X",16,0,null,null,"明細部繰返（１１７バイト × ２明細）　　　　　　　　　　　　　"]
[null,null,"68",null,"商品名",null,"X/N",40,null,"○","商品名",null,"(英数カナは25文字、漢字は20文字)",null,null,null,null,null,null,null,null,"○","○","○","属性＋桁数","9","商品名","X",25,0,null,"5",null,"行NO",null,20,"9",2,null,"○"]
[null,null,"69",null,"包装区分",null,9,1,null,"◎","数量の発注単位の区分",null,"(1:ケース発注時)","(2:ボール発注時)","(3:バラ発注時)",null,"1:ケース発注\n2:ボール発注\n","3:バラ発注",null,"必須＋ｺｰﾄﾞ",null,"○","○",null,null,"10","包装区分","9",1,0,null,"6",null,"専用伝票行NO",null,22,"9",2]
[null,null,"70",null,"内容","ボール内バラ数",9,4,2,"○","包装区分に準じた設定",null,"(ボール内バラ数","/ボール内バラ数","/ゼロ)",null,null,null,"属性＋桁数","属性",null,"○","○",null,null,"11",{"$f":"IF($Z85=\"\",\"\",VLOOKUP($Z85,$AF$78:$AN$102,4,))","v":"ボール内バラ数"},"9",4,2,null,"7",null,"商品コード識別区分",null,24,"X",1,null,"○"]
[null,null,"71",null,null,"ケース内ボール数",9,2,null,"○","包装区分に準じた設定",null,"(ケース内ボール数","/ゼロ","/ゼロ)",null,null,null,"属性＋桁数","属性",null,"○","○",null,null,"12",{"$f":"IF($Z86=\"\",\"\",VLOOKUP($Z86,$AF$78:$AN$102,4,))","v":"ケース内ボール数"},"9",2,0,null,"8",null,"品番",null,25,"X",16,null,"○"]
[null,null,"72",null,"数量符号",null,"X",1,null,"○","数量の符号",null,null,null,null,null,"△/＋:正数","－:負数","属性","ｺｰﾄﾞ",null,"○","○","○","コード\n2:利用停止","13",{"$f":"IF($Z87=\"\",\"\",VLOOKUP($Z87,$AF$78:$AN$102,3,))","v":"数量符号"},"X",1,0,null,"9",null,"商品名",null,41,"X",25,null,"○"]
[null,null,"73",null,"数量","ケース数量",9,7,null,"○","包装区分に準じた設定",null,"(ケース数量","/ゼロ","/ゼロ)",null,null,null,"属性＋桁数","属性",null,"○","○",null,null,"14",{"$f":"IF($Z88=\"\",\"\",VLOOKUP($Z88,$AF$78:$AN$102,4,))","v":"ケース数量"},"9",7,0,null,"10",null,"包装区分",null,66,"9",1,null,"○"]
[null,null,"74",null,null,"ボール数量",9,7,null,"○","包装区分に準じた設定",null,"(ゼロ","/ボール数量","/ゼロ)",null,null,null,"属性＋桁数","属性",null,"○","○",null,null,"15",{"$f":"IF($Z89=\"\",\"\",VLOOKUP($Z89,$AF$78:$AN$102,4,))","v":"ボール数量"},"9",7,0,null,"11",null,"内容","ボール内バラ数",67,"9",4,2,"○"]
[null,null,"75",null,null,"バラ数量",9,7,2,"○","包装区分に準じた設定",null,"(バラ数量","/バラ数量","バラ数量)",null,null,null,"属性＋桁数","属性",null,"○","○",null,null,"16",{"$f":"IF($Z90=\"\",\"\",VLOOKUP($Z90,$AF$78:$AN$102,4,))","v":"バラ数量"},"9",7,2,null,"12",null,null,"ケース内ボール数",73,"9",2,null,"○"]
[null,null,"76",null,"単価","卸店入価格",9,6,2,null,"卸店入価格",null,"(バラ単価)",null,null,null,null,null,"属性＋桁数","属性",null,"○","○",null,null,"17",{"$f":"IF($Z91=\"\",\"\",VLOOKUP($Z91,$AF$78:$AN$102,4,))","v":"卸店入価格"},"9",6,2,null,"13",null,"数量符号",null,75,"X",1,null,"○"]
[null,null,"77",null,null,"二次店納入価格",9,6,2,null,"二次卸店等への納入価格",null,"(バラ単価)",null,null,null,null,null,"属性＋桁数","属性",null,"○","○",null,null,"18",{"$f":"IF($Z92=\"\",\"\",VLOOKUP($Z92,$AF$78:$AN$102,4,))","v":"二次店納入価格"},"9",6,2,null,"14",null,"数量","ケース数量",76,"9",7,null,"○"]
[null,null,"78",null,"金額符号",null,"X",1,null,"○","金額の符号",null,null,null,null,null,"△/＋:正数","－:負数","属性","ｺｰﾄﾞ",null,"○","○","○","コード","19",{"$f":"IF($Z93=\"\",\"\",VLOOKUP($Z93,$AF$78:$AN$102,3,))","v":"金額符号"},"X",1,0,null,"15",null,null,"ボール数量",83,"9",7,null,"○"]
[null,null,"79",null,"金額","卸店入金額",9,8,null,"○","卸店入金額",null,null,null,null,null,null,null,"属性＋桁数","属性",null,"○","○",null,null,"20",{"$f":"IF($Z94=\"\",\"\",VLOOKUP($Z94,$AF$78:$AN$102,4,))","v":"卸店入金額"},"9",8,0,null,"16",null,null,"バラ数量",90,"9",7,2,"○"]
[null,null,"80",null,null,"二次店納入金額",9,8,null,null,"二次卸店等への納入金額",null,null,null,null,null,null,null,"属性＋桁数","属性",null,"○","○",null,null,"21",{"$f":"IF($Z95=\"\",\"\",VLOOKUP($Z95,$AF$78:$AN$102,4,))","v":"二次店納入金額"},"9",8,0,null,"17",null,"単価","卸店入価格",99,"9",6,2,"○"]
[null,null,"81",null,"返品区分",null,"X",1,null,null,"当面使用しない",null,null,null,null,null,"△",null,null,"ｺｰﾄﾞ",null,"○","○",null,null,"22",{"$f":"IF($Z96=\"\",\"\",VLOOKUP($Z96,$AF$78:$AN$102,3,))","v":"返品区分"},"X",1,0,null,"18",null,null,"二次店納入価格",107,"9",6,2]
[null,null,"82",null,"入荷単位ケース数",null,9,2,null,null,"荷合せ品の場合の１梱包ケース数量を指定する",null,null,null,null,null,"00～20",null,"属性＋桁数","ｺｰﾄﾞ",null,"○","属性初期値","◎",null,null,"","","","",null,"19",null,"金額符号",null,115,"X",1,null,"○"]
[null,null,"83",null,"卸発注行番号",null,9,2,null,null,null,null,"(未使用)",null,null,null,null,null,null,null,null,"○","属性初期値","◎",null,null,"","","","",null,"20",null,"金額","卸店入金額",116,"9",8,null,"○"]
[null,null,"84",null,"納入単価表示区分",null,"X",1,null,null,null,null,"(未使用)",null,null,null,null,null,null,null,null,"○","属性初期値","◎",null,null,"","","","",null,"21",null,null,"二次店納入金額",124,"9",8]
[null,null,"85",null,"卸最新在庫日付区分",null,"X",1,null,null,null,null,"(未使用)",null,null,null,null,null,null,null,null,"○","属性初期値","◎",null,null,"","","","",null,"22",null,"返品区分",null,132,"X",1]
[null,null,"86",null,"卸最新在庫日付",null,9,8,null,null,null,null,"(未使用)",null,null,null,null,null,null,null,null,"○","属性初期値","◎",null,null,"","","","",null,"23",null,"予備１",null,133,"X",4]
[null,null,"87",null,"入庫許容日付区分",null,"X",1,null,null,null,null,"(未使用)",null,null,null,null,null,null,null,null,"○","属性初期値","◎",null,null,"","","","",null,"24","予備２",null,null,254,"X",3]
[null,null,"88",null,"入庫許容日付",null,9,8,null,null,null,null,"(未使用)",null,null,null,null,null,null,null,null,"○","属性初期値","◎",null,null,"","","",""]
[null,null,"89",null,"温度管理区分",null,"X",1,null,null,null,null,"(未使用)",null,null,null,null,null,null,null,null,"○","属性初期値","◎",null,null,"","","",""]
[null,null,"90",null,"摘要",null,"X/N",50,null,null,"任意使用",null,"(英数カナは50文字、漢字は25文字)",null,null,null,null,null,null,null,null,"○","属性初期値","◎",null,null,"","","",""]
[null,null,"91",null,"日本語区分（商品名）",null,"X",1,null,null,"該当項目の日本語区分",null,null,null,null,null,"△/0:英数カナ\n1:　　漢字(S-JIS/JIS/JEF/IBM)",null,null,"ｺｰﾄﾞ",null,"○","属性初期値","◎",null,null,"","","",""]
[null,null,"92",null,"日本語区分（摘要）",null,"X",1,null,null,"　　〃 ",null,null,null,null,null,"　　〃 ",null,null,"ｺｰﾄﾞ",null,"○","属性初期値","◎",null,null,"","","","",null,null,"   ④ トレーラレコード"]
[null,null,"93","   ③ トレーラレコード","菓子業界商品分類コード",null,"X",6,null,null,"菓子業界の新商品分類コード",null,"(JICFSの機能分類コードとして登録)",null,null,null,null,null,"桁数",null,null,"○","属性初期値","◎",null,null,"","","","",null,"項番","　項目",null,null,"開始位置","属性","整数桁","小数桁","必須"]
[null,"2.6\n2.8","94",null,"明細連携エリア",null,"X","10",null,null,"新フォーマット間：相対利用可能エリア",null,null,null,null,null,null,null,"桁数",null,null,"○","属性初期値","◎",null,null,"","","",""]
[null,1.8,"95","レコード件数",null,null,9,6,null,"○","レコードの総件数\n・データ送信側では、自身のフォーマットのレコード件数を設定する。\n・データ受信側では、当項目と実際のレコード件数の整合性チェックには利用しない。※下記【トレーラレコード連携時の留意事項】を参照のこと\n",null,null,null,null,null,null,null,"属性＋桁数","属性","センタチェック","※ センター集計値","　　※ センター集計値",null,null,"5",{"$f":"IF($Z110=\"\",\"\",VLOOKUP($Z110,$AF$114:$AN$127,2,))","v":"レコード件数"},{"$f":"IF($Z110=\"\",\"\",VLOOKUP($Z110,$AF$114:$AN$127,6,))","v":"9"},{"$f":"IF($Z110=\"\",\"\",VLOOKUP($Z110,$AF$114:$AN$127,7,))","v":6},{"$f":"IF($Z110=\"\",\"\",VLOOKUP($Z110,$AF$114:$AN$127,8,))","v":0},null,"1","データ種別",null,null,1,"9",2,null,"○"]
[null,null,"96","伝票枚数",null,null,9,6,null,null,"伝票枚数",null,null,null,null,null,null,null,"属性＋桁数","属性","と同じ","※ センター集計値","　　※ センター集計値",null,null,"6",{"$f":"IF($Z111=\"\",\"\",VLOOKUP($Z111,$AF$114:$AN$127,2,))","v":"伝票枚数"},{"$f":"IF($Z111=\"\",\"\",VLOOKUP($Z111,$AF$114:$AN$127,6,))","v":"9"},{"$f":"IF($Z111=\"\",\"\",VLOOKUP($Z111,$AF$114:$AN$127,7,))","v":6},{"$f":"IF($Z111=\"\",\"\",VLOOKUP($Z111,$AF$114:$AN$127,8,))","v":0},null,"2","送信先コード",null,null,3,"9",8,null,"○"]
[null,null,"97","合計金額符号",null,null,"X",1,null,null,"合計金額の符号",null,null,null,null,null,"△/＋:正数","－:負数","属性","ｺｰﾄﾞ",null,"※ センター設定　 ","　　※ センター設定　 ","○","コード","7",{"$f":"IF($Z112=\"\",\"\",VLOOKUP($Z112,$AF$114:$AN$127,2,))","v":"合計金額符号"},{"$f":"IF($Z112=\"\",\"\",VLOOKUP($Z112,$AF$114:$AN$127,6,))","v":"X"},{"$f":"IF($Z112=\"\",\"\",VLOOKUP($Z112,$AF$114:$AN$127,7,))","v":1},{"$f":"IF($Z112=\"\",\"\",VLOOKUP($Z112,$AF$114:$AN$127,8,))","v":0},null,"3","送信元コード",null,null,11,"9",8,null,"○"]
[null,null,"98","合計金額",null,null,9,10,null,null,"卸店入金額の全明細行の金額合計",null,null,null,null,null,null,null,"属性＋桁数","属性",null,"※ センター集計値","　　※ センター集計値",null,null,"8",{"$f":"IF($Z113=\"\",\"\",VLOOKUP($Z113,$AF$114:$AN$127,2,))","v":"合計金額"},{"$f":"IF($Z113=\"\",\"\",VLOOKUP($Z113,$AF$114:$AN$127,6,))","v":"9"},{"$f":"IF($Z113=\"\",\"\",VLOOKUP($Z113,$AF$114:$AN$127,7,))","v":10},{"$f":"IF($Z113=\"\",\"\",VLOOKUP($Z113,$AF$114:$AN$127,8,))","v":0},null,"4","レコード区分",null,null,19,"9",1,null,"○"]
[null,null,"99","連携エリア",null,null,"X",20,null,null,"新フォーマット間：相対利用可能エリア",null,null,null,null,null,null,null,null,null,null,"○","属性初期値","◎",null,null,{"$f":"IF($Z114=\"\",\"\",VLOOKUP($Z114,$AF$114:$AN$127,2,))","v":""},{"$f":"IF($Z114=\"\",\"\",VLOOKUP($Z114,$AF$114:$AN$127,6,))","v":""},{"$f":"IF($Z114=\"\",\"\",VLOOKUP($Z114,$AF$114:$AN$127,7,))","v":""},{"$f":"IF($Z114=\"\",\"\",VLOOKUP($Z114,$AF$114:$AN$127,8,))","v":""},null,"5","レコード件数",null,null,20,"9",6,null,"○"]
[null,null,"100","一次店カナ名",null,null,"X",30,null,null,"一次店カナ名",null,"(一次店名 に漢字を設定する場合、必須)",null,null,null,null,null,null,null,null,"○ ","属性初期値","◎",null,null,{"$f":"IF($Z115=\"\",\"\",VLOOKUP($Z115,$AF$21:$AN$33,2,))","v":""},{"$f":"IF($Z115=\"\",\"\",VLOOKUP($Z115,$AF$21:$AN$33,6,))","v":""},{"$f":"IF($Z115=\"\",\"\",VLOOKUP($Z115,$AF$21:$AN$33,7,))","v":""},{"$f":"IF($Z115=\"\",\"\",VLOOKUP($Z115,$AF$21:$AN$33,8,))","v":""},null,"6","伝票枚数",null,null,26,"9",6]
[null,null,"101","二次店カナ名",null,null,"X",30,null,null,"二次店カナ名",null,"(二次店名 に漢字を設定する場合、必須)",null,null,null,null,null,null,null,null,"○ ","属性初期値","◎",null,null,{"$f":"IF($Z116=\"\",\"\",VLOOKUP($Z116,$AF$21:$AN$33,2,))","v":""},{"$f":"IF($Z116=\"\",\"\",VLOOKUP($Z116,$AF$21:$AN$33,6,))","v":""},{"$f":"IF($Z116=\"\",\"\",VLOOKUP($Z116,$AF$21:$AN$33,7,))","v":""},{"$f":"IF($Z116=\"\",\"\",VLOOKUP($Z116,$AF$21:$AN$33,8,))","v":""},null,"7","合計金額符号",null,null,32,"X",1]
[null,null,"102","届け先カナ名",null,null,"X",30,null,null,"届け先カナ名",null,"(届け先名  に漢字を設定する場合、必須)",null,null,null,null,null,null,null,null,"○ ","属性初期値","◎",null,null,{"$f":"IF($Z117=\"\",\"\",VLOOKUP($Z117,$AF$21:$AN$33,2,))","v":""},{"$f":"IF($Z117=\"\",\"\",VLOOKUP($Z117,$AF$21:$AN$33,6,))","v":""},{"$f":"IF($Z117=\"\",\"\",VLOOKUP($Z117,$AF$21:$AN$33,7,))","v":""},{"$f":"IF($Z117=\"\",\"\",VLOOKUP($Z117,$AF$21:$AN$33,8,))","v":""},null,"8","合計金額",null,null,33,"9",10]
[null,null,"103","摘要カナ",null,null,"X",30,null,null,"摘要カナ",null,"(摘要        に漢字を設定する場合、必須)",null,null,null,null,null,null,null,null,"○ ","属性初期値","◎",null,null,{"$f":"IF($Z118=\"\",\"\",VLOOKUP($Z118,$AF$21:$AN$33,2,))","v":""},{"$f":"IF($Z118=\"\",\"\",VLOOKUP($Z118,$AF$21:$AN$33,6,))","v":""},{"$f":"IF($Z118=\"\",\"\",VLOOKUP($Z118,$AF$21:$AN$33,7,))","v":""},{"$f":"IF($Z118=\"\",\"\",VLOOKUP($Z118,$AF$21:$AN$33,8,))","v":""}]
[null,null,"104","商品名カナ",null,null,"X","25",null,null,"商品名カナ",null,"(商品名に 漢字を設定する場合、必須)",null,null,null,null,null,null,null,null,"○","属性初期値","◎"]
[null,2.8,"105","資産譲渡日付",null,null,"X","4",null,null,"資産譲渡日付",null,"(西暦 YYMM)",null,null,null,null,null,null,null,null,"○","属性初期値","◎",null,null,{"$f":"IF($Z120=\"\",\"\",VLOOKUP($Z120,$AF$78:$AN$102,3,))","v":""},{"$f":"IF($Z120=\"\",\"\",VLOOKUP($Z120,$AF$78:$AN$102,6,))","v":""},{"$f":"IF($Z120=\"\",\"\",VLOOKUP($Z120,$AF$78:$AN$102,7,))","v":""},{"$f":"IF($Z120=\"\",\"\",VLOOKUP($Z120,$AF$78:$AN$102,8,))","v":""}]
[null,null,"106","改行コード",null,null,"X","2",null,null,"S-JISの改行コードを設定",null,null,null,null,null,null,null,null,null,null,null,null,null,null,null,{"$f":"IF($Z121=\"\",\"\",VLOOKUP($Z121,$AF$114:$AN$127,2,))","v":""},{"$f":"IF($Z121=\"\",\"\",VLOOKUP($Z121,$AF$114:$AN$127,6,))","v":""},{"$f":"IF($Z121=\"\",\"\",VLOOKUP($Z121,$AF$114:$AN$127,7,))","v":""},{"$f":"IF($Z121=\"\",\"\",VLOOKUP($Z121,$AF$114:$AN$127,8,))","v":""}]
[null,null,null,null,null,null,null,null,null,null,null,null,null,null,null,null,null,null,null,null,null,"※ 配信分割時"]
[null,null,null,null,null,null,null,null,null,null,null,null,null,null,null,null,null,null,null,null,null,null,null,null,null,null,{"$f":"IF($Z123=\"\",\"\",VLOOKUP($Z123,$AF$114:$AN$127,2,))","v":""},{"$f":"IF($Z123=\"\",\"\",VLOOKUP($Z123,$AF$114:$AN$127,6,))","v":""},{"$f":"IF($Z123=\"\",\"\",VLOOKUP($Z123,$AF$114:$AN$127,7,))","v":""},{"$f":"IF($Z123=\"\",\"\",VLOOKUP($Z123,$AF$114:$AN$127,8,))","v":""}]
[null,null,null,null,null,null,null,null,null,null," ※ファイルの形式は、カンマ区切りの可変長形式となります。各項目の値にダブルクォート「\"」の囲みは不要です。"]
[null,null,null,null,null,null,null,null,null,null," ※画面から受信（ダウンロード）したファイルの最終行にはエンドレコードが出力されます。"]
[null,null,null,null,null,null,null,null,null,null,"　  エンドレコードのレイアウトは「エンドレコード」を参照してください。"]
[null,null,null,null,null,null,null,null,null,null," ※画面から送信（アップロード）するファイルにエンドレコードは不要です。"]

{"sheet":"２３出荷報告","index":12,"n_rows":166,"n_cols":43,"rows_kept":166,"cut":false,"hidden":false,"merged":[[17,10,17,11],[17,12,17,14],[47,38,48,38],[47,31,48,31],[47,32,48,33],[47,35,48,35],[47,36,48,36],[47,37,48,37],[109,23,109,27],[109,2,110,2],[109,3,110,4],[109,6,110,6],[109,7,110,7],[109,8,110,8],[62,23,62,24],[110,23,110,24],[61,1,62,1],[61,2,62,2],[61,3,62,4],[61,6,62,6],[61,7,62,7],[61,8,62,8],[61,9,62,9],[61,10,62,10],[61,16,62,16],[63,16,63,17],[61,23,61,27],[109,9,110,9],[109,10,110,10],[109,16,110,16],[3,10,4,10],[3,9,4,9],[3,6,4,6],[3,38,4,38],[3,23,3,27],[3,35,4,35],[3,36,4,36],[3,37,4,37],[4,23,4,24],[3,31,4,31],[3,32,4,33],[3,1,4,1],[123,16,123,17],[148,10,148,15],[45,16,45,17],[50,16,50,17],[85,16,85,17],[31,16,31,17],[70,16,70,17],[74,16,74,17],[117,16,117,17],[3,2,4,2],[3,3,4,4],[3,16,4,16],[3,8,4,8],[3,7,4,7],[109,1,110,1]]}
[null,null,null,null,null,null,null,null,null,null,null,null,null,null,null,null,null,null,null,null,null,null,null,null,null,null,null,null,null,null,null,{"$f":"シート別総ページ数","v":{"$error":"#NAME?"}}]
[null,null,"（５） Ｖ２・２３出荷報告",null,null,null,null,null,null,null,null,null,null,null,null,null,null,null,null,null,null,null,null,null,null,null,null,null,null,null,null,"（３） Ｖ１・２２出荷報告"]
[null,null,"　",null,null,null,null,null,null,null,null,null,null,null,null,null,null,null,null,null,null,null,null,null,null,null,null,null,null,null,null,"　"]
[null,"変更","項番","　項目",null,null,"属性","整数桁","小数桁","必須","　項目説明",null,null,null,null,null,"　コード",null,"アップロード","V２ → Ｖ１･Ｖ２","Ｖ２→ Ｖ１","Ｖ２ ← Ｖ２","Ｖ２ ← Ｖ１","　　　　　　　Ｖ１フォーマット",null,null,null,null,null,null,null,"項番","　項目",null,null,"属性","整数桁","小数桁","必須"]
[null,null,null,null,null,null,null,null,null,null,null,null,null,null,null,null,null,null,"チェック","センタチェック","センタチェック","コンバート","コンバート","比較・  変更点",null,"項番","　　項目","属性","整数","小数"]
[null,null,"1","データ種別",null,null,9,2,null,"◎","２３：出荷報告データ",null,null,null,null,null,"23",null,"必須","ｺｰﾄﾞ",null,"○","\"23\"固定","○","ｺｰﾄﾞ",null,{"$f":"IF($Z6=\"\",\"\",VLOOKUP($Z6,$AF$6:$AM$17,2,))","v":""},{"$f":"IF($Z6=\"\",\"\",VLOOKUP($Z6,$AF$6:$AM$17,6,))","v":""},{"$f":"IF($Z6=\"\",\"\",VLOOKUP($Z6,$AF$6:$AM$17,7,))","v":""},{"$f":"IF($Z6=\"\",\"\",VLOOKUP($Z6,$AF$6:$AM$17,8,))","v":""},null,"1","データ種別",null,null,"9",2,null,"◎"]
[null,null,"2","最終トレーラ判定区分",null,null,"X",1,null,"◎","トレーラ判定の区分",null,null,null,null,null,"9:最終","△:それ以外",null,"ｺｰﾄﾞ",null,"○","○",null,null,"2",{"$f":"IF($Z7=\"\",\"\",VLOOKUP($Z7,$AF$6:$AM$84,2,))","v":"最終トレーラ判定区分"},{"$f":"IF($Z7=\"\",\"\",VLOOKUP($Z7,$AF$6:$AM$84,5,))","v":"X"},{"$f":"IF($Z7=\"\",\"\",VLOOKUP($Z7,$AF$6:$AM$84,6,))","v":1},{"$f":"IF($Z7=\"\",\"\",VLOOKUP($Z7,$AF$6:$AM$84,7,))","v":0},null,"2","最終トレーラ判定区分",null,null,"X",1,null,"◎"]
[null,null,"3","送信先コード",null,null,9,8,null,"◎","送信先(卸)","の統一取引先コード",null,null,null,null,null,null,"必須＋属性＋桁数＋登録","センター登録",null,"○","○",null,null,"3","送信先コード","9",8,0,null,"3","送信先コード",null,null,"9",8,null,"◎"]
[null,null,"4","送信元コード",null,null,9,8,null,"◎","送信元(メーカ)","の統一取引先コード",null,null,null,null,null,null,"必須＋属性＋桁数＋登録","センター登録",null,"○","○",null,null,"4","送信元コード","9",8,0,null,"4","送信元コード",null,null,"9",8,null,"◎"]
[null,null,"5","データ作成日",null,null,9,8,null,"◎","データ作成日付",null,"(西暦 YYYYMMDD)",null,null,null,null,null,null,"必須＋日付","センタチェック","○","○",null,null,"5","データ作成日","9",8,0,null,"5","データ作成日",null,null,"9",8,null,"○"]
[null,null,"6","データ作成時刻",null,null,9,6,null,null,"データ作成時刻",null,"(HHMMSS)",null,null,null,null,null,null,"時刻","と同じ","○","属性初期値","◎",null,null,"","","","",null,"6","送信先名",null,null,"X",20,null,"○"]
[null,null,"7","送信先名",null,null,"X",20,null,"○","送信元(卸)名 　          　",null,"(英数カナのみ)",null,null,null,null,null,"属性",null,null,"○","○",null,null,"6","送信先名","X",20,0,null,"7","送信元名",null,null,"X",20,null,"○"]
[null,null,"8","送信元名",null,null,"X",20,null,"◎","送信先(メーカ)名          ",null,"(英数カナのみ)",null,null,null,null,null,"属性","必須",null,"○","○",null,null,"7","送信元名","X",20,0,null,"8","直接送信先コード",null,null,"9",8]
[null,null,"9","直接送信先コード",null,null,9,8,null,null,"送信先コードと異なる場合にセット          ",null,"(通常はゼロ)",null,null,null,null,null,null,"センター登録",null,"○","○",null,null,"8","直接送信先コード","9",8,0,null,"9","直接送信先カナ名",null,null,"X",20]
[null,null,"10","直接送信先名",null,null,"X",20,null,null,"直接送信先名",null,"(英数カナのみ、通常はスペース)",null,null,null,null,null,"属性",null,null,"○","○",null,null,"9","直接送信先カナ名","X",20,0,null,"10","予備０１",null,null,"X",161]
[null,null,"11","送信ファイルNO",null,null,9,2,null,null,"同時送信時の問合せ№",null,"(00～99)",null,null,null,null,null,null,"属性",null,"○","属性初期値","◎",null,null,"","","","",null,"11","伝票NO",null,null,"9",6,null,"○"]
[null,null,"12","連携エリア",null,null,"X",20,null,null,"新フォーマット間：相対利用可能エリア",null,null,null,null,null,null,null,null,null,null,"○","属性初期値","◎",null,null,"","","","",null,"12","店入直送区分",null,null,"9",1,null,"○"]
[null,1.7,"13","卸発注伝票NO",null,null,9,8,null,null,"受発注データの伝票ＮＯ\n直送返品時は返品ＮＯ",null,"(6桁→8桁に拡張、6桁運用の時は上２桁ゼロ埋め）\n受発注データで受けた場合は必ずセット",null,null,null,null,null,null,"属性",null,"○","予備上2桁(不正時\"00\")\n＋卸伝票NO","○","桁数","37\n34","予備０３\n卸伝票ＮＯ","X\n9","2\n6",0,null,"13","取引コード",null,null,"9",2,null,"○"]
[null,null,"14","メーカ伝票NO",null,null,9,8,null,"○","メーカ発行伝票№",null,"(6桁→8桁に拡張、6桁運用の時は上２桁ゼロ埋め）",null,null,null,null,null,"属性＋桁数","属性",null,"○","伝票NO","○","桁数","11",{"$f":"IF($Z19=\"\",\"\",VLOOKUP($Z19,$AF$6:$AM$84,2,))","v":"伝票NO"},{"$f":"IF($Z19=\"\",\"\",VLOOKUP($Z19,$AF$6:$AM$84,5,))","v":"9"},{"$f":"IF($Z19=\"\",\"\",VLOOKUP($Z19,$AF$6:$AM$84,6,))","v":6},{"$f":"IF($Z19=\"\",\"\",VLOOKUP($Z19,$AF$6:$AM$84,7,))","v":0},null,"14","取引年月日",null,null,"9",8,null,"○"]
[null,null,"15","店入直送区分",null,null,9,1,null,"◎","店(倉)入れまたは直送等の区分",null,null,null,null,null,"1:店入\n2:直送\n","3:店引取\n4:直送引取",null,"必須＋ｺｰﾄﾞ",null,"○","○","○","ｺｰﾄﾞ","12","店入直送区分","9",1,0,null,"15","予備０２",null,null,"X",4]
[null,2.7,"16","取引コード",null,null,9,2,null,"◎","業界統一取引コード",null,null,null,null,null,"11:店入売上\n12:店入売上訂正\n21:店入返品\n22:店入返品訂正\n31:直送売上\n32:直送売上訂正\n\n\n\n","41:直送返品\n42:直送返品訂正\n51:割戻し金\n52:相殺\n81:ﾒｰｶｰ提供の役務\n91:卸提供の役務",null,"必須＋ｺｰﾄﾞ",null,"○","○",null,null,"13","取引コード","9",2,0,null,"16","明細行数",null,null,"9",2,null,"○"]
[null,null,"17","取引年月日",null,null,9,8,null,"○","納品年月日 ",null,"(西暦 YYYYMMDD)",null,null,null,null,null,"属性＋桁数","日付",null,"○","○",null,null,"14","取引年月日","9",8,0,null,"17","一次店コード",null,null,"9",8,null,"○"]
[null,null,"18","出荷年月日",null,null,9,8,null,null,"出荷日／引取日",null,"(西暦 YYYYMMDD)",null,null,null,null,null,null,"日付",null,"○","属性初期値","◎",null,null,"","","","",null,"18","二次店コード",null,null,"9",8]
[null,null,"19","着荷予定日",null,null,9,8,null,null,"着荷予定日",null,"(西暦 YYYYMMDD)",null,null,null,null,null,null,"日付",null,"○","属性初期値","◎",null,null,"","","","",null,"19","届け先コード",null,null,"9",8,null,"○"]
[null,null,"20","納入予定時間",null,null,9,4,null,null,"納入予定時間",null,"(HHMM)",null,null,null,null,null,null,"時刻",null,"○","属性初期値","◎",null,null,"","","","",null,"20","専用伝票日付",null,null,"9",8]
[null,null,"21","倉庫コード",null,null,"X",4,null,null,"メーカの出荷倉庫を識別",null,"(相対協議)",null,null,null,null,null,null,null,null,"○","属性初期値","◎",null,null,"","","","",null,"21","専用伝票NO",null,null,"9",9]
[null,null,"22","伝送区分",null,null,"X",1,null,null,"請求データの伝送区分",null,null,null,null,null,"1:全部送信\n2:違算分送信","△:無指定",null,"ｺｰﾄﾞ",null,"○","属性初期値","◎",null,null,"","","","",null,"22","伝票合計金額符号",null,null,"X",1,null,"○"]
[null,null,"23","出荷報告以外区分",null,null,"X",1,null,null,"請求と出荷報告との関係",null,null,null,null,null,"0:提供\n1:未提供","2:再請求\n△:無指定",null,"ｺｰﾄﾞ",null,"○","属性初期値","◎",null,null,"","","","",null,"23","伝票合計金額",null,null,"9",8,null,"○"]
[null,2.2000000000000002,"24","集計明細区分",null,null,"X",1,null,null,"請求データを明細または伝票集計での作成区分",null,null,null,null,null,"△:明細","1:集計（※未使用）",null,"ｺｰﾄﾞ",null,"○","属性初期値","◎",null,null,"","","","",null,"24","二次店納入金額符号",null,null,"X",1]
[null,null,"25","請求締日",null,null,9,8,null,null,"提供企業の請求最終締日",null,"(西暦 YYYYMMDD)",null,null,null,null,null,"属性＋桁数","日付",null,"○","属性初期値","◎",null,null,"","","","",null,"25","二次店納入合計金額",null,null,"9",8]
[null,null,"26","請求口座",null,null,"X",10,null,null,"提供企業の請求口座コード",null,null,null,null,null,null,null,null,null,null,"○","属性初期値","◎",null,null,"","","","",null,"26","一次店カナ名",null,null,"X",30,null,"○"]
[null,null,"27","請求支払区分",null,null,9,2,null,null,"請求・支払データのデータの発生区分",null,null,null,null,null,"00:今回分請求・支払\n10:前回分請求・今回未払分\n20:請求控除",null,null,"ｺｰﾄﾞ",null,"○","属性初期値","◎",null,null,"","","","",null,"27","二次店カナ名",null,null,"X",30]
[null,null,"28","明細行数",null,null,9,2,null,null,"伝票内明細数",null,null,null,null,null,"00～06",null,null,"ｺｰﾄﾞ",null,"○","○",null,null,"16","明細行数","9",2,0,null,"28","届け先カナ名",null,null,"X",30,null,"○"]
[null,null,"29","一次店コード",null,null,"X",13,null,"◎","統一取引先コード(8桁)",null,null,null,"(後方スペース埋め)",null,null,null,"必須＋桁数","必須",null,"○","前詰８桁＋空白５桁","○","属性＋桁数","17","一次店コード","9",8,0,null,"29","元伝日付",null,null,"9",8]
[null,null,"30","二次店コード",null,null,"X",13,null,null,"統一取引先コード(8桁)／プライベート・コード(3～8桁)／ＧＬＮ(13桁)",null,null,null,"(後方スペース埋め)",null,null,null,"桁数",null,"統一取引先のみ","○","前詰８桁＋空白５桁","○","属性＋桁数","18","二次店コード","9",8,0,null,"30","元伝NO",null,null,"9",6]
[null,null,"31","三次店コード",null,null,"X",13,null,null,"統一取引先コード(8桁)／プライベート・コード(3～8桁)／ＧＬＮ(13桁)",null,null,null,"(後方スペース埋め)",null,null,null,"桁数",null,null,"○","属性初期値","◎",null,null,"","","","",null,"31","摘要欄",null,null,"X",30]
[null,null,"32","届け先コード",null,null,"X",13,null,"○","統一取引先コード(8桁)／プライベート・コード(3～8桁)／ＧＬＮ(13桁)",null,null,null,"(後方スペース埋め)",null,null,null,"桁数",null,"統一取引先のみ","○","前詰８桁＋空白５桁","○","属性＋桁数","19","届け先コード","9",8,0,null,"32","メーカ所属組織名",null,null,"X",10]
[null,null,"33","チェーン店コード",null,null,"X",13,null,null,"統一取引先コード(8桁)／プライベート・コード(3～8桁)／ＧＬＮ(13桁)",null,null,null,"(後方スペース埋め)",null,null,null,"桁数",null,null,"○","属性初期値","◎",null,null,"","","","",null,"33","伝票区分",null,null,"9",1,null,"○"]
[null,null,"34","専用伝票日付",null,null,9,8,null,null,"納品伝票が専用伝票の場合にセット",null,"(西暦 YYYYMMDD)",null,null,null,null,null,null,"日付",null,"○","○",null,null,"20","専用伝票日付","9",8,0,null,"34","卸伝票ＮＯ",null,null,"9",6]
[null,null,"35","専用伝票NO",null,null,9,9,null,null,"　　〃              　　　　    ",null,"(専用伝票№、左ゼロ埋め)",null,null,null,null,null,null,"属性",null,"○","○",null,null,"21","専用伝票NO","9",9,0,null,"35","定番特売区分",null,null,"X",1,null,"○"]
[null,null,"36","元伝年月日",null,null,9,8,null,null,"メーカで訂正した元伝票の納品日",null,"(西暦 YYYYMMDD)",null,null,null,null,null,"属性＋桁数","日付",null,"○","○",null,null,"29","元伝日付","9",8,0,null,"36","登録店区分",null,null,"X",1,null,"○"]
[null,null,"37","元伝NO",null,null,9,8,null,null,"メーカで訂正した元伝票の伝票№",null,"(6桁運用の時は上２桁ゼロ埋め)",null,null,null,null,null,null,"属性",null,"○","○","○","桁数","30","元伝NO","9",6,0,null,"37","予備０３",null,null,"X",2]
[null,null,"38","伝票合計金額符号",null,null,"X",1,null,"○","伝票の合計金額の符号",null,null,null,null,null,"△/＋:正数","－:負数","属性","ｺｰﾄﾞ",null,"○","○","○","ｺｰﾄﾞ","22","伝票合計金額符号","X",1,0]
[null,null,"39","伝票合計金額",null,null,9,8,null,"○","伝票の合計金額",null,"(卸店入価格、１億円未満)",null,null,null,null,null,"属性＋桁数","属性",null,"○","○",null,null,"23","伝票合計金額","9",8,0]
[null,null,"40","二次店納入合計金額符号",null,null,"X",1,null,null,"正味納入合計金額の符号",null,null,null,null,null,"△/＋:正数","－:負数","属性","ｺｰﾄﾞ",null,"○","○","○","ｺｰﾄﾞ","24","二次店納入金額符号","X",1,0]
[null,null,"41","二次店納入合計金額",null,null,9,8,null,null,"正味納入合計金額",null,"(二次店納入価格、１億円未満）",null,null,null,null,null,"属性＋桁数","属性",null,"○","○",null,null,"25","二次店納入合計金額","9",8,0]
[null,null,"42","一次店名",null,null,"X/N",40,null,"○","一次店名",null,"(英数カナは30文字、漢字は20文字)",null,null,null,null,null,null,null,null,"○","○","○","属性＋桁数","26","一次店カナ名","X",30,0]
[null,null,"43","二次店名",null,null,"X/N",40,null,null,"二次店名",null,"(英数カナは30文字、漢字は20文字)",null,null,null,null,null,null,null,null,"○","○","○","属性＋桁数","27","二次店カナ名","X",30,0,null,"項番","　項目",null,null,"属性","整数桁","小数桁","必須"]
[null,null,"44","三次店名",null,null,"X/N",40,null,null,"三次店名",null,"(英数カナは30文字、漢字は20文字)",null,null,null,null,null,null,null,null,"○","属性初期値","◎",null,null,"","","",""]
[null,null,"45","届け先名",null,null,"X/N",40,null,"○","届け先名",null,"(英数カナは30文字、漢字は20文字)",null,null,null,null,null,null,null,null,"○","○","○","属性＋桁数","28","届け先カナ名","X",30,0,null,null,"明細部　　　　　　　　　　　　　　　　　　　　　　　　　　　　　　　　　　　　　　　　"]
[null,null,"46","チェーン店名",null,null,"X/N",40,null,null,"チェーン店名",null,"(英数カナは30文字、漢字は20文字)",null,null,null,null,null,null,null,null,"○","属性初期値","◎",null,null,"","","","",null,"38",null,"行ＮＯ",null,"9",2,null,"○"]
[null,null,"47","電話番号",null,null,"X",15,null,null,"通常は届け先の電話番号  ",null,"(局番区切り(-)あり)",null,null,null,null,null,null,null,null,"○","属性初期値","◎",null,null,"","","","",null,"39",null,"専用伝票行ＮＯ",null,"9",2]
[null,null,"48","住所",null,null,"X/N",80,null,null,"通常は届け先の住所         ",null,"(英数カナは60文字、漢字は40文字)",null,null,null,null,null,null,null,null,"○","属性初期値","◎",null,null,"","","","",null,"40",null,"商品コード識別区分",null,"X",1,null,"○"]
[null,null,"49","摘要",null,null,"X/N",50,null,null,"伝票の摘要欄の内容",null,"(英数カナは50文字、漢字は25文字）",null,null,null,null,null,null,null,null,"○","○","○","属性＋桁数","31","摘要欄","X",30,0,null,"41",null,"品番",null,"X",16,null,"○"]
[null,null,"50","メーカコード",null,null,"X",9,null,null,"７桁の場合は後ろスペース",null,"(49xxxxx / 45xxxxxxx)",null,null,null,null,null,null,null,null,"○","属性初期値","◎",null,null,"","","","",null,"42",null,"商品名",null,"X",25,null,"○"]
[null,null,"51","メーカ所属組織名",null,null,"X",10,null,null,"スペース",null,null,null,null,null,null,null,"属性",null,null,"○","○",null,null,"32","メーカ所属組織名","X",10,0,null,"43",null,"包装区分",null,"9",1,null,"○"]
[null,null,"（次頁に続く）",null,null,null,null,null,null,null,null,null,null,null,null,null,null,null,null,null,null,null,null,null,null,null,null,null,null,null,null,"44",null,"内容","ボール内バラ数","9",4,2,"○"]
[null,null,null,null,null,null,null,null,null,null,null,null,null,null,null,null,null,null,null,null,null,null,null,null,null,null,null,null,null,null,null,"45",null,null,"ケース内ボール数","9",2,null,"○"]
[null,null,"　",null,null,null,null,null,null,null,null,null,null,null,null,null,null,null,null,null,null,null,null,null,null,null,null,null,null,null,null,"46",null,"数量符号",null,"X",1,null,"○"]
[null,null,null,null,null,null,null,null,null,null,null,null,null,null,null,null,null,null,null,null,null,null,null,null,null,null,null,null,null,null,null,"47",null,"数量","ケース数量","9",7,null,"○"]
[null,null,"（前頁の続き）",null,null,null,null,null,null,null,null,null,null,null,null,null,null,null,null,null,null,null,null,null,null,null,null,null,null,null,null,"48",null,null,"ボール数量","9",7,null,"○"]
[null,"変更","項番","　項目",null,null,"属性","整数桁","小数桁","必須","　項目説明",null,null,null,null,null,"　コード",null,"アップロード","V２ → Ｖ１･Ｖ２","Ｖ２→ Ｖ１","Ｖ２ ← Ｖ２","Ｖ２ ← Ｖ１","　　　　　　　Ｖ１フォーマット",null,null,null,null,null,null,null,"49",null,null,"バラ数量","9",7,2,"○"]
[null,null,null,null,null,null,null,null,null,null,null,null,null,null,null,null,null,null,"チェック","センタチェック","センタチェック","コンバート","コンバート","比較・  変更点",null,"項番","　　項目","属性","整数","小数",null,"50",null,"単価","卸店入価格","9",6,2,"○"]
[null,null,"52","伝票区分",null,null,9,1,null,"○","伝票発行の区分",null,null,null,null,null,"0:菓子統一伝票\n1:ﾁｪｰﾝｽﾄｱ伝票(伝票№なし)\n2:専用伝票      (伝票№あり)\n3:専用伝票      (伝票№なし)\n4:ﾁｪｰﾝｽﾄｱ伝票(ﾀｰﾝｱﾗｳﾝﾄﾞ型)\n8:伝票レス",null,null,"ｺｰﾄﾞ(新)",null,"○","\"△\" → \"0\"","○","コード","33",{"$f":"IF($Z64=\"\",\"\",VLOOKUP($Z64,$AF$6:$AM$84,2,))","v":"伝票区分"},{"$f":"IF($Z64=\"\",\"\",VLOOKUP($Z64,$AF$6:$AM$84,5,))","v":"9"},{"$f":"IF($Z64=\"\",\"\",VLOOKUP($Z64,$AF$6:$AM$84,6,))","v":1},{"$f":"IF($Z64=\"\",\"\",VLOOKUP($Z64,$AF$6:$AM$84,7,))","v":0},null,"51",null,null,"二次店納入価格","9",6,2,"○"]
[null,null,"53","登録店区分",null,null,"X",1,null,"○","メーカ登録店区分を指定",null,null,null,null,null,"0:登録店以外\n1:登録店","△:無指定","属性","ｺｰﾄﾞ",null,"○","○","○","コード","36","登録店区分","X",1,0,null,"52",null,"金額符号",null,"X",1,null,"○"]
[null,null,"54","定番特売区分",null,null,"X",1,null,"○","定番発注/特売発注の区分",null,null,null,null,null,"0:定番\n1:特売\n","△:分類不能","属性","ｺｰﾄﾞ",null,"○","\"0\"・\"1\"以外 → \"△\"","○","コード","35","定番特売区分","X",1,0,null,"53",null,"金額","卸店入金額","9",8,null,"○"]
[null,2.1,"55","消費税区分",null,null,"X",1,null,"○","税区分",null,null,null,null,null,"1:外税\n2:内税\n","3:非課税\n△:個別判断",null,"ｺｰﾄﾞ",null,"○","属性初期値","◎",null,null,"","","","",null,"54",null,null,"二次店納入金額","9",8,null,"○"]
[null,"2.1\n2.0","56","消費税率",null,null,9,2,1,"○","消費税の税率(99.9％)、ゼロ:個別判断　",null,null,"(小数点以下1桁)",null,null,null,null,"属性＋桁数","属性",null,"○","税率区分により設定\n△/0 → 080\n   1  → 100",null,null,"68","税率区分","X","1",0,null,"55",null,"商品添付区分",null,"X",1,null,"○"]
[null,null,"57","ロット不足運賃負担区分",null,null,"X",1,null,null,"発注ロット不足になった場合の運賃負担の区分",null,null,null,null,null,"△:無指定\n1:卸負担\n","2:負担なし",null,"ｺｰﾄﾞ",null,"○","属性初期値","◎",null,null,"","","","",null,"56",null,"予備０４",null,"9",4]
[null,null,"58","取引先区分（一次店）",null,null,"X",1,null,null,"該当項目の取引先の属性区分",null,null,null,null,null,"△:統一取引先(8桁)",null,null,"ｺｰﾄﾞ",null,"○","属性初期値","◎",null,null,"","","","",null,"57","予備０５",null,null,"X",3]
[null,1.3,"59","取引先区分（二次店）",null,null,"X",1,null,null,"　　〃 ",null,null,null,null,null,"△:  統一取引先(8桁)\n6:   GLN(13桁)\n7/8:プライベートコード(卸/ﾒｰｶ)",null,null,"ｺｰﾄﾞ",null,"○","属性初期値","◎",null,null,"","","","",null,"58","レコード件数",null,null,"9",6,null,"○"]
[null,null,"60","取引先区分（三次店）",null,null,"X",1,null,null,"　　〃 ",null,null,null,null,null,"　　〃 ",null,null,"ｺｰﾄﾞ",null,"○","属性初期値","◎",null,null,"","","","",null,"59","伝票枚数",null,null,"9",6]
[null,1.3,"61","取引先区分（届け先）",null,null,"X",1,null,null,"　　〃 ",null,null,null,null,null,"　　〃 ",null,null,"ｺｰﾄﾞ",null,"○","属性初期値","◎",null,null,"","","","",null,"60","合計金額符号",null,null,"X",1]
[null,null,"62","取引先区分（チェーン店）",null,null,"X",1,null,null,"　　〃 ",null,null,null,null,null,"　　〃 ",null,null,"ｺｰﾄﾞ",null,"○","属性初期値","◎",null,null,"","","","",null,"61","合計金額",null,null,"9",10]
[null,null,"63","日本語区分（一次店）",null,null,"X",1,null,null,"該当項目の日本語区分",null,null,null,null,null,"△/0:英数カナ\n1:　　漢字(S-JIS/JIS/JEF/IBM)",null,null,"ｺｰﾄﾞ",null,"○","属性初期値","◎",null,null,"","","","",null,"62","予備０６",null,null,"X",214]
[null,null,"64","日本語区分（二次店）",null,null,"X",1,null,null,"　　〃 ",null,null,null,null,null,"　　〃 ",null,null,"ｺｰﾄﾞ",null,"○","属性初期値","◎",null,null,"","","","",null,"63","一次店漢字名",null,null,"X",60]
[null,null,"65","日本語区分（三次店）",null,null,"X",1,null,null,"　　〃 ",null,null,null,null,null,"　　〃 ",null,null,"ｺｰﾄﾞ",null,"○","属性初期値","◎",null,null,"","","","",null,"64","二次店漢字名",null,null,"X",60]
[null,null,"66","日本語区分（届け先）",null,null,"X",1,null,null,"　　〃 ",null,null,null,null,null,"　　〃 ",null,null,"ｺｰﾄﾞ",null,"○","属性初期値","◎",null,null,"","","","",null,"65","届け先漢字名",null,null,"X",60]
[null,null,"67","日本語区分（チェーン店）",null,null,"X",1,null,null,"　　〃 ",null,null,null,null,null,"　　〃 ",null,null,"ｺｰﾄﾞ",null,"○","属性初期値","◎",null,null,"","","","",null,"66","摘要欄０２",null,null,"X",50]
[null,null,"68","日本語区分（住所）",null,null,"X",1,null,null,"　　〃 ",null,null,null,null,null,"　　〃 ",null,null,"ｺｰﾄﾞ",null,"○","属性初期値","◎",null,null,"","","","",null,"67","予備０７",null,null,"X",7]
[null,null,"69","日本語区分（摘要）",null,null,"X",1,null,null,"　　〃 ",null,null,null,null,null,"　　〃 ",null,null,"ｺｰﾄﾞ",null,"○","属性初期値","◎",null,null,"","","","",null,"68","税率区分",null,null,"X","1"]
[null,null,"70","ヘッダー連携エリア",null,null,"X",20,null,null,"新フォーマット間：相対利用可能エリア",null,null,null,null,null,null,null,null,null,null,"○","属性初期値","◎",null,null,"","","","",null,"69","資産譲渡日付",null,null,"X","4"]
[null,1.5,null,"明細部　　　　　　　　　　　　　　　　　　　　　　　　　　　　　　　　　　　　　　　　",null,null,null,null,null,null,null,null,null,null,null,null,null,null,null,null,null,null,null,null,null,null,"","","","",null,"70","改行コード",null,null,"X","2"]
[null,null,"71",null,"明細行NO",null,9,2,null,"◎","伝票内明細数",null,null,null,null,null,"01～06",null,null,"必須＋ｺｰﾄﾞ",null,"○","6行変換設定","○","名称","38",{"$f":"IF($Z84=\"\",\"\",VLOOKUP($Z84,$AF$6:$AM$84,3,))","v":"行ＮＯ"},"9",2,0]
[null,null,"72",null,"専用伝票行NO",null,9,2,null,null,"専用伝票の行№",null,"(00～99)",null,null,null,null,null,null,"属性",null,"○","○",null,null,"39","専用伝票行ＮＯ","9",2,0]
[null,null,"73",null,"商品コード識別区分",null,9,1,null,null,"品番(商品コード)の識別区分",null,null,null,null,null,"0:統一商品コード\n1:ＩＴＦコード (14桁)\n2:ＩＴＦコード(16桁)  【利用停止化】\n3:JANコード    (標準:13桁)\n4:JANコード    (短縮:8桁)\n6:GTINコード  (14桁)",null,"属性","コード(新)",null,"○","○","○","属性＋コード\n2:利用停止","40","商品コード識別区分","X",1,0]
[null,null,"74",null,"品番",null,"X",16,null,null,"統一商品ｺｰﾄﾞ､ITFｺｰﾄﾞ､JANｺｰﾄﾞ､GTINｺｰﾄﾞ",null,null,"(左詰め)",null,null,null,null,"属性",null,null,"○","○","○","ITF(16)\n利用停止","41","品番","X",16,0]
[null,null,"75",null,"商品名",null,"X/N",40,null,null,"商品名",null,"(英数カナは25文字、漢字は20文字)",null,null,null,null,null,null,null,null,"○","○","○","属性＋桁数","42","商品名","X",25,0]
[null,null,"76",null,"包装区分",null,9,1,null,"◎","数量の発注単位の区分",null,"(1:ケース発注時)","(2:ボール発注時)","(3:バラ発注時)",null,"1:ケース発注\n2:ボール発注\n","3:バラ発注",null,"必須＋ｺｰﾄﾞ",null,"○","○",null,null,"43","包装区分","9",1,0]
[null,null,"77",null,"内容","ボール内バラ数",9,4,2,null,"包装区分に準じた設定",null,"(ボール内バラ数","/ボール内バラ数","/ゼロ)",null,null,null,"属性＋桁数","属性",null,"○","○",null,null,"44",{"$f":"IF($Z90=\"\",\"\",VLOOKUP($Z90,$AF$6:$AM$84,4,))","v":"ボール内バラ数"},"9",4,2]
[null,null,"78",null,null,"ケース内ボール数",9,2,null,null,"包装区分に準じた設定",null,"(ケース内ボール数","/ゼロ","/ゼロ)",null,null,null,"属性＋桁数","属性",null,"○","○",null,null,"45",{"$f":"IF($Z91=\"\",\"\",VLOOKUP($Z91,$AF$6:$AM$84,4,))","v":"ケース内ボール数"},"9",2,0]
[null,null,"79",null,"数量符号",null,"X",1,null,null,"数量の符号",null,null,null,null,null,"△/＋:正数","－:負数","属性","ｺｰﾄﾞ",null,"○","○","○","コード\n2:利用停止","46",{"$f":"IF($Z92=\"\",\"\",VLOOKUP($Z92,$AF$6:$AM$84,3,))","v":"数量符号"},"X",1,0]
[null,null,"80",null,"数量","ケース数量",9,7,null,null,"包装区分に準じた設定",null,"(ケース数量","/ゼロ","/ゼロ)",null,null,null,"属性＋桁数","属性",null,"○","○",null,null,"47",{"$f":"IF($Z93=\"\",\"\",VLOOKUP($Z93,$AF$6:$AM$84,4,))","v":"ケース数量"},"9",7,0]
[null,null,"81",null,null,"ボール数量",9,7,null,null,"包装区分に準じた設定",null,"(ゼロ","/ボール数量","/ゼロ)",null,null,null,"属性＋桁数","属性",null,"○","○",null,null,"48",{"$f":"IF($Z94=\"\",\"\",VLOOKUP($Z94,$AF$6:$AM$84,4,))","v":"ボール数量"},"9",7,0]
[null,null,"82",null,null,"バラ数量",9,7,2,null,"包装区分に準じた設定",null,"(バラ数量","/バラ数量","バラ数量)",null,null,null,"属性＋桁数","属性",null,"○","○",null,null,"49",{"$f":"IF($Z95=\"\",\"\",VLOOKUP($Z95,$AF$6:$AM$84,4,))","v":"バラ数量"},"9",7,2]
[null,null,"83",null,"単価","卸店入価格",9,6,2,null,"卸店入価格",null,"(バラ単価)",null,null,null,null,null,"属性＋桁数","属性",null,"○","○",null,null,"50",{"$f":"IF($Z96=\"\",\"\",VLOOKUP($Z96,$AF$6:$AM$84,4,))","v":"卸店入価格"},"9",6,2]
[null,null,"84",null,null,"二次店納入価格",9,6,2,null,"二次卸店等への納入価格",null,"(バラ単価)",null,null,null,null,null,"属性＋桁数","属性",null,"○","○",null,null,"51",{"$f":"IF($Z97=\"\",\"\",VLOOKUP($Z97,$AF$6:$AM$84,4,))","v":"二次店納入価格"},"9",6,2]
[null,null,"85",null,"金額符号",null,"X",1,null,null,"金額の符号",null,null,null,null,null,"△/＋:正数","－:負数","属性","ｺｰﾄﾞ",null,"○","○","○","コード\n2:利用停止","52",{"$f":"IF($Z98=\"\",\"\",VLOOKUP($Z98,$AF$6:$AM$84,3,))","v":"金額符号"},"X",1,0]
[null,null,"86",null,"金額","卸店入金額",9,8,null,null,"卸店入金額",null,null,null,null,null,null,null,"属性＋桁数","属性",null,"○","○",null,null,"53",{"$f":"IF($Z99=\"\",\"\",VLOOKUP($Z99,$AF$6:$AM$84,4,))","v":"卸店入金額"},"9",8,0]
[null,null,"87",null,null,"二次店納入金額",9,8,null,null,"二次卸店等への納入金額",null,null,null,null,null,null,null,"属性＋桁数","属性",null,"○","○",null,null,"54",{"$f":"IF($Z100=\"\",\"\",VLOOKUP($Z100,$AF$6:$AM$84,4,))","v":"二次店納入金額"},"9",8,0]
[null,null,"88",null,"商品添付区分",null,"X",1,null,null,"添付商品扱いの区分",null,"(相対運用)",null,null,null,"△:売上げ\n1:現物添付","2:見本\n3:景品","属性","ｺｰﾄﾞ(新)",null,"○","\"0\" → \"△\"",null,null,"55",{"$f":"IF($Z101=\"\",\"\",VLOOKUP($Z101,$AF$6:$AM$84,3,))","v":"商品添付区分"},"X",1,0]
[null,null,"89",null,"欠品区分",null,9,2,null,null,"商品の出荷状況を指定",null,null,null,null,null,"00:正常\n01:品切れ\n02:終売","03:未発売\n04:コード訂正\n",null,"ｺｰﾄﾞ(新)",null,"○","属性初期値","◎",null,null,{"$f":"IF($Z102=\"\",\"\",VLOOKUP($Z102,$AF$6:$AM$84,2,))","v":""},"","",""]
[null,null,"90",null,"入荷単位ケース数",null,9,2,null,null,"荷合せ品の場合の１梱包ケース数量を指定する",null,null,null,null,null,"00～20",null,null,"ｺｰﾄﾞ",null,"○","属性初期値","◎",null,null,{"$f":"IF($Z103=\"\",\"\",VLOOKUP($Z103,$AF$6:$AM$84,2,))","v":""},"","",""]
[null,null,"91",null,"単価計算区分",null,"X",1,null,null,"単価×数量の計算方法を指定する",null,"(小数点以下端数の計算処置方法)",null,null,null,"△:切捨て\n1:切上げ","2:四捨五入",null,"ｺｰﾄﾞ",null,"○","属性初期値","◎",null,null,{"$f":"IF($Z104=\"\",\"\",VLOOKUP($Z104,$AF$6:$AM$84,2,))","v":""},"","",""]
[null,null,"（次頁に続く）"]
[]
[null,null,"　"]
[]
[null,null,"（前頁の続き）"]
[null,"変更","項番","　項目",null,null,"属性","整数桁","小数桁","必須","　項目説明",null,null,null,null,null,"　コード",null,"アップロード","V２ → Ｖ１･Ｖ２","Ｖ２→ Ｖ１","Ｖ２ ← Ｖ２","Ｖ２ ← Ｖ１","　　　　　　　Ｖ１フォーマット"]
[null,null,null,null,null,null,null,null,null,null,null,null,null,null,null,null,null,null,"チェック","センタチェック","センタチェック","コンバート","コンバート","比較・  変更点",null,"項番","　　項目","属性","整数","小数"]
[null,null,"92",null,"卸発注行番号",null,9,2,null,null,"卸売業での発注伝票行NO",null,"(00～99)",null,null,null,null,null,null,"属性",null,"○","属性初期値","◎",null,null,{"$f":"IF($Z112=\"\",\"\",VLOOKUP($Z112,$AF$6:$AM$84,2,))","v":""},{"$f":"IF($Z112=\"\",\"\",VLOOKUP($Z112,$AF$6:$AM$84,5,))","v":""},{"$f":"IF($Z112=\"\",\"\",VLOOKUP($Z112,$AF$6:$AM$84,6,))","v":""},{"$f":"IF($Z112=\"\",\"\",VLOOKUP($Z112,$AF$6:$AM$84,7,))","v":""}]
[null,null,"93",null,"卸最新在庫日付区分",null,"X",1,null,null,"卸最新在庫日付の日付区分",null,null,null,null,null,"△:未使用\n1:製造日\n","2:賞味期限",null,"ｺｰﾄﾞ",null,"○","属性初期値","◎",null,null,"","","",""]
[null,null,"94",null,"卸最新在庫日付",null,9,8,null,null,"賞味期限／製造日",null,"(西暦 YYYYMMDD、賞味年月表示は月末最終日）",null,null,null,null,null,"属性＋桁数","日付",null,"○","属性初期値","◎",null,null,"","","",""]
[null,null,"95",null,"入庫許容日付区分",null,"X",1,null,null,"入庫許容日付の日付区分",null,null,null,null,null,"△:未使用\n1:製造日\n","2:賞味期限",null,"ｺｰﾄﾞ",null,"○","属性初期値","◎",null,null,"","","",""]
[null,null,"96",null,"入庫許容日付",null,9,8,null,null,"賞味期限／製造日",null,"(西暦 YYYYMMDD、賞味年月表示は月末最終日）",null,null,null,null,null,"属性＋桁数","日付",null,"○","属性初期値","◎",null,null,"","","",""]
[null,null,"97",null,"実入庫製品日付区分",null,"X",1,null,null,"実入庫製品日付の日付区分",null,null,null,null,null,"△:未使用\n1:製造日\n","2:賞味期限",null,"ｺｰﾄﾞ",null,"○","属性初期値","◎",null,null,"","","",""]
[null,null,"98",null,"実入庫製品日付",null,9,8,null,null,"賞味期限／製造日",null,"(西暦 YYYYMMDD、賞味年月表示は月末最終日）",null,null,null,null,null,"属性＋桁数","日付",null,"○","属性初期値","◎",null,null,"","","",""]
[null,null,"99",null,"製造ロット番号",null,"X",10,null,null,"出荷商品の製造ロット番号を指定する",null,null,null,null,null,null,null,null,null,null,"○","属性初期値","◎",null,null,"","","",""]
[null,null,"100",null,"温度管理区分",null,"X",1,null,null,"該当商品の温度帯管理区",null,null,null,null,null,"△/0:常温\n1:28℃以下\n2:20℃以下\n\n","3:冷蔵(10℃以下)\n4:冷凍(-15℃\n                 以下)",null,"ｺｰﾄﾞ",null,"○","属性初期値","◎",null,null,"","","",""]
[null,null,"101",null,"製品容器区分",null,9,1,null,null,"該当商品の製品・容器かを指定",null,null,null,null,null,"0:製品","1:容器",null,"ｺｰﾄﾞ",null,"○","属性初期値","◎",null,null,"","","",""]
[null,null,"102",null,"外箱GTIN(ITF)コード",null,"X",14,null,null,"実際に入庫する外箱のＩＴＦコードを指定する",null,null,null,null,null,null,null,null,null,null,"○","属性初期値","◎",null,null,"","","",""]
[null,null,"103",null,"摘要",null,"X/N",50,null,null,"任意使用",null,"(英数カナは50文字、漢字は25文字)",null,null,null,null,null,null,null,null,"○","属性初期値","◎",null,null,"","","",""]
[null,null,"104",null,"日本語区分（商品名）",null,"X",1,null,null,"該当項目の日本語区分",null,null,null,null,null,"△/0:英数カナ\n1:　　漢字(S-JIS/JIS/JEF/IBM)",null,null,"ｺｰﾄﾞ",null,"○","属性初期値","◎",null,null,"","","",""]
[null,null,"105",null,"日本語区分（摘要）",null,"X",1,null,null,"　　〃 ",null,null,null,null,null,"　　〃 ",null,null,"ｺｰﾄﾞ",null,"○","属性初期値","◎",null,null,"","","",""]
[null,null,"106",null,"菓子業界商品分類コード",null,"X",6,null,null,"菓子業界の新商品分類コード",null,"(JICFSの機能分類コードとして登録)",null,null,null,null,null,null,null,null,"○","属性初期値","◎",null,null,"","","",""]
[null,null,"107",null,"割戻1","割戻計算区分","X",1,null,null,"割戻計算の小数点以下端数処理の計算区分",null,null,null,null,null,"△:切捨て\n1:切上げ","2:四捨五入",null,"ｺｰﾄﾞ",null,"○","属性初期値","◎",null,null,"","","",""]
[null,null,"108",null,null,"割戻区分","X",1,null,null,"割戻の条件区分",null,"(相対で設定)",null,null,null,null,null,null,null,null,"○","属性初期値","◎",null,null,"","","",""]
[null,null,"109",null,null,"割戻基準","X",1,null,null,"割戻の基準の区分",null,null,null,null,null,"△:割戻率\n1:割戻単価","2:割戻金額",null,"ｺｰﾄﾞ",null,"○","属性初期値","◎",null,null,"","","",""]
[null,null,"110",null,null,"割戻率／単価",9,4,2,null,"割戻率／割戻単価／金額の時はゼロ",null,"(小数点以下2桁)",null,null,null,null,null,"属性＋桁数","属性",null,"○","属性初期値","◎",null,null,"","","",""]
[null,null,"111",null,null,"割戻金額符号","X",1,null,null,"割戻金額の符号",null,null,null,null,null,"△/＋:正数","－:負数",null,"ｺｰﾄﾞ",null,"○","属性初期値","◎",null,null,"","","",""]
[null,null,"112",null,null,"割戻金額",9,8,null,null,"割戻計算結果を金額で指定",null,"(円単位)",null,null,null,null,null,"属性＋桁数","属性",null,"○","属性初期値","◎",null,null,"","","",""]
[null,null,"113",null,null,"割戻コード","X",5,null,null,"割戻の種類を表す",null,null,null,null,null,null,null,null,null,null,"○","属性初期値","◎",null,null,"","","",""]
[null,null,"114",null,"割戻2","割戻計算区分","X",1,null,null,"割戻1に同じ",null,null,null,null,null,"割戻1に同じ",null,null,"ｺｰﾄﾞ",null,"○","属性初期値","◎",null,null,"","","",""]
[null,null,"115",null,null,"割戻区分","X",1,null,null,null,null,null,null,null,null,null,null,null,null,null,"○","属性初期値","◎",null,null,"","","",""]
[null,null,"116",null,null,"割戻基準","X",1,null,null,null,null,null,null,null,null,null,null,null,"ｺｰﾄﾞ",null,"○","属性初期値","◎",null,null,"","","",""]
[null,null,"117",null,null,"割戻率／単価",9,4,2,null,null,null,null,null,null,null,null,null,"属性＋桁数","属性",null,"○","属性初期値","◎",null,null,"","","",""]
[null,null,"118",null,null,"割戻金額符号","X",1,null,null,null,null,null,null,null,null,null,null,null,"ｺｰﾄﾞ",null,"○","属性初期値","◎",null,null,"","","",""]
[null,null,"119",null,null,"割戻金額",9,8,null,null,null,null,null,null,null,null,null,null,"属性＋桁数","属性",null,"○","属性初期値","◎",null,null,"","","",""]
[null,null,"120",null,null,"割戻コード","X",5,null,null,null,null,null,null,null,null,null,null,null,null,null,"○","属性初期値","◎",null,null,"","","",""]
[null,null,"121",null,"割戻3","割戻計算区分","X",1,null,null,"割戻1に同じ",null,null,null,null,null,"割戻1に同じ",null,null,"ｺｰﾄﾞ",null,"○","属性初期値","◎",null,null,"","","",""]
[null,null,"122",null,null,"割戻区分","X",1,null,null,null,null,null,null,null,null,null,null,null,null,null,"○","属性初期値","◎",null,null,"","","",""]
[null,null,"123",null,null,"割戻基準","X",1,null,null,null,null,null,null,null,null,null,null,null,"ｺｰﾄﾞ",null,"○","属性初期値","◎",null,null,"","","",""]
[null,null,"124",null,null,"割戻率／単価",9,4,2,null,null,null,null,null,null,null,null,null,"属性＋桁数","属性",null,"○","属性初期値","◎",null,null,"",{"$f":"IF($Z144=\"\",\"\",VLOOKUP($Z144,$AF$6:$AM$84,5,))","v":""},{"$f":"IF($Z144=\"\",\"\",VLOOKUP($Z144,$AF$6:$AM$84,6,))","v":""},{"$f":"IF($Z144=\"\",\"\",VLOOKUP($Z144,$AF$6:$AM$84,7,))","v":""}]
[null,null,"125",null,null,"割戻金額符号","X",1,null,null,null,null,null,null,null,null,null,null,null,"ｺｰﾄﾞ",null,"○","属性初期値","◎",null,null,"","","",""]
[null,null,"126",null,null,"割戻金額",9,8,null,null,null,null,null,null,null,null,null,null,"属性＋桁数","属性",null,"○","属性初期値","◎",null,null,"","","",""]
[null,null,"127",null,null,"割戻コード","X",5,null,null,null,null,null,null,null,null,null,null,null,null,null,"○","属性初期値","◎",null,null,"","","",""]
[null,"2.6\n2.8","128",null,"明細連携エリア",null,"X","10",null,null,"旧フォーマット予備連携データ",null,"(新フォーマット間：相対利用可能エリア)",null,null,null,null,null,null,null,null,"○","○","◎",null,null,{"$f":"IF($Z148=\"\",\"\",VLOOKUP($Z148,$AF$6:$AM$84,3,))","v":""},"","","",null,null,null,null,null,null,null,null,null,null,null,null,"YYMM"]
[null,1.8,"129","レコード件数",null,null,9,6,null,"○","レコードの総件数\n・データ送信側では、自身のフォーマットのレコード件数を設定する。\n・データ受信側では、当項目と実際のレコード件数の整合性チェックには利用しない。※下記【トレーラレコード連携時の留意事項】を参照のこと\n",null,null,null,null,null,null,null,"属性＋桁数","属性",null,"※ センター集計値","　　※ センター集計値",null,null,"58",{"$f":"IF($Z149=\"\",\"\",VLOOKUP($Z149,$AF$6:$AM$84,2,))","v":"レコード件数"},"9",6,0]
[null,null,"130","伝票枚数",null,null,9,6,null,null,"伝票枚数",null,null,null,null,null,null,null,"属性＋桁数","属性",null,"※ センター集計値","　　※ センター集計値",null,null,"59","伝票枚数","9",6,0]
[null,null,"131","合計金額符号",null,null,"X",1,null,null,"合計金額の符号",null,null,null,null,null,"△/＋:正数","－:負数","属性","ｺｰﾄﾞ",null,"※ センター設定　 ","　　※ センター設定　 ","○","コード","60","合計金額符号","X",1,0]
[null,null,"132","合計金額",null,null,9,10,null,null,"卸店入金額の全明細行の金額合計",null,null,null,null,null,null,null,"属性＋桁数","属性",null,"※ センター集計値","　　※ センター集計値",null,null,"61","合計金額","9",10,0]
[null,null,"133","連携エリア",null,null,"X",20,null,null,"旧フォーマット予備連携データ",null,"(新フォーマット間：相対利用可能エリア)",null,null,null,null,null,null,null,null,"○","　予備の01-10ﾊﾞｲﾄ＋\n　予備の26-35ﾊﾞｲﾄ　","◎",null,"62","予備０６","X",214,0]
[null,1.1000000000000001,"134","一次店カナ名",null,null,"X",30,null,null,"一次店カナ名",null,"(一次店名 に漢字を設定する場合、必須)",null,null,null,null,null,null,null,null,"○","属性初期値","◎",null,null,"","","",""]
[null,1.1000000000000001,"135","二次店カナ名",null,null,"X",30,null,null,"二次店カナ名",null,"(二次店名 に漢字を設定する場合、必須)",null,null,null,null,null,null,null,null,"○","属性初期値","◎",null,null,"","","",""]
[null,1.1000000000000001,"136","届け先カナ名",null,null,"X",30,null,null,"届け先カナ名",null,"(届け先名  に漢字を設定する場合、必須)",null,null,null,null,null,null,null,null,"○","属性初期値","◎",null,null,"","","",""]
[null,1.1000000000000001,"137","摘要カナ",null,null,"X",30,null,null,"摘要カナ",null,"(摘要        に漢字を設定する場合、必須)",null,null,null,null,null,null,null,null,"○","属性初期値","◎",null,null,"","","",""]
[null,1.1000000000000001,"138","商品名カナ",null,null,"X",25,null,null,"商品名カナ",null,"(商品名     に漢字を設定する場合、必須)",null,null,null,null,null,null,null,null,"○","属性初期値","◎",null,null,"","","",""]
[null,2.8,"139","資産譲渡日付",null,null,"X","4",null,null,"資産譲渡日付",null,"(西暦 YYMM)",null,null,null,null,null,null,null,null,"○","○",null,null,"69","資産譲渡日付","X","4",0]
[null,null,"140","改行コード",null,null,"X","2",null,null,"S-JISの改行コードを設定",null,null,null,null,null,null,null,null,null,null,null,null,null,null,null,"","","",""]
[null,null,null,null,null,null,null,null,null,null,null,null,null,null,null,null,null,null,null,null,null,"※ 配信分割時",null,null,null,null,{"$f":"IF($Z161=\"\",\"\",VLOOKUP($Z161,$AF$150:$AM$164,2,))","v":""},{"$f":"IF($Z161=\"\",\"\",VLOOKUP($Z161,$AF$150:$AM$164,6,))","v":""},{"$f":"IF($Z161=\"\",\"\",VLOOKUP($Z161,$AF$150:$AM$164,7,))","v":""},{"$f":"IF($Z161=\"\",\"\",VLOOKUP($Z161,$AF$150:$AM$164,8,))","v":""}]
[null,null,null,null,null,null,null,null,null,null,null,null,null,null,null,null,null,null,null,null,null,null,null,null,null,null,{"$f":"IF($Z162=\"\",\"\",VLOOKUP($Z162,$AF$150:$AM$164,2,))","v":""},{"$f":"IF($Z162=\"\",\"\",VLOOKUP($Z162,$AF$150:$AM$164,6,))","v":""},{"$f":"IF($Z162=\"\",\"\",VLOOKUP($Z162,$AF$150:$AM$164,7,))","v":""},{"$f":"IF($Z162=\"\",\"\",VLOOKUP($Z162,$AF$150:$AM$164,8,))","v":""}]
[null,null,null,null,null,null,null,null,null,null," ※ファイルの形式は、カンマ区切りの可変長形式となります。各項目の値にダブルクォート「\"」の囲みは不要です。"]
[null,null,null,null,null,null,null,null,null,null," ※画面から受信（ダウンロード）したファイルの最終行にはエンドレコードが出力されます。"]
[null,null,null,null,null,null,null,null,null,null,"　  エンドレコードのレイアウトは「エンドレコード」を参照してください。"]
[null,null,null,null,null,null,null,null,null,null," ※画面から送信（アップロード）するファイルにエンドレコードは不要です。"]

{"sheet":"３５請求明細","index":13,"n_rows":258,"n_cols":39,"rows_kept":258,"cut":false,"hidden":false,"merged":[[47,38,48,38],[47,31,48,31],[47,32,48,33],[47,35,48,35],[47,36,48,36],[47,37,48,37],[57,1,58,1],[57,2,58,2],[57,3,58,4],[57,6,58,6],[57,7,58,7],[120,1,121,1],[120,2,121,2],[120,3,121,4],[120,6,121,6],[120,7,121,7],[186,23,186,27],[187,23,187,24],[186,1,187,1],[186,2,187,2],[186,3,187,4],[186,6,187,6],[186,7,187,7],[57,8,58,8],[57,9,58,9],[57,10,58,10],[57,16,58,16],[186,8,187,8],[186,9,187,9],[186,10,187,10],[186,16,187,16],[120,8,121,8],[120,9,121,9],[120,10,121,10],[120,16,121,16],[97,12,97,14],[102,12,102,14],[128,10,128,14],[120,23,120,27],[28,16,28,17],[3,9,4,9],[3,16,4,16],[163,10,163,15],[84,16,84,17],[88,16,88,17],[45,16,45,17],[3,10,4,10],[29,16,29,17],[26,16,26,17],[138,16,138,17],[57,23,57,27],[99,16,99,17],[58,23,58,24],[121,23,121,24],[3,35,4,35],[3,36,4,36],[3,37,4,37],[3,38,4,38],[3,1,4,1],[3,31,4,31],[3,32,4,33],[3,23,3,27],[4,23,4,24],[3,2,4,2],[3,3,4,4],[3,6,4,6],[3,7,4,7],[3,8,4,8]]}
[null,null,null,null,null,null,null,null,null,null,null,null,null,null,null,null,null,null,null,null,null,null,null,null,null,null,null,null,null,null,null,{"$f":"シート別総ページ数","v":{"$error":"#NAME?"}}]
[null,null,"（６） Ｖ２・３５請求明細"]
[null,null,"　"]
[null,"変更","項番","　項目",null,null,"属性","整数桁","小数桁","必須","　項目説明",null,null,null,null,null,"　コード",null,"アップロード","V２ → Ｖ１･Ｖ２","Ｖ２→ Ｖ１","Ｖ２ ← Ｖ２","Ｖ２ ← Ｖ１","　　　　　　　Ｖ１フォーマット",null,null,null,null,null,null,null,"項番","　項目",null,null,"属性","整数桁","小数桁","必須"]
[null,null,null,null,null,null,null,null,null,null,null,null,null,null,null,null,null,null,"チェック","センタチェック","センタチェック","コンバート","コンバート","比較・  変更点",null,"項番","　　項目","属性","整数","小数"]
[null,null,"1","データ種別",null,null,9,2,null,"◎","３５：請求明細データ",null,null,null,null,null,"35",null,"必須","ｺｰﾄﾞ",null,"○","\"35\"固定","○","ｺｰﾄﾞ",null,{"$f":"IF($Z6=\"\",\"\",VLOOKUP($Z6,$AF$6:$AM$26,2,))","v":""},{"$f":"IF($Z6=\"\",\"\",VLOOKUP($Z6,$AF$6:$AM$26,6,))","v":""},{"$f":"IF($Z6=\"\",\"\",VLOOKUP($Z6,$AF$6:$AM$26,7,))","v":""},{"$f":"IF($Z6=\"\",\"\",VLOOKUP($Z6,$AF$6:$AM$26,8,))","v":""},null,"1","データ種別",null,null,9,2,null,"◎"]
[null,null,"2","最終トレーラ判定区分",null,null,"X",1,null,"◎","トレーラ判定の区分",null,null,null,null,null,"9:最終","△:それ以外",null,"ｺｰﾄﾞ",null,"○","○",null,null,"2",{"$f":"IF($Z7=\"\",\"\",VLOOKUP($Z7,$AF$6:$AM$71,2,))","v":"最終トレーラ判定区分"},{"$f":"IF($Z7=\"\",\"\",VLOOKUP($Z7,$AF$6:$AM$71,5,))","v":"X"},{"$f":"IF($Z7=\"\",\"\",VLOOKUP($Z7,$AF$6:$AM$71,6,))","v":1},{"$f":"IF($Z7=\"\",\"\",VLOOKUP($Z7,$AF$6:$AM$71,7,))","v":0},null,"2","最終トレーラ判定区分",null,null,"X",1,null,"◎"]
[null,null,"3","送信先コード",null,null,9,8,null,"◎","送信先(卸)","の統一取引先コード",null,null,null,null,null,null,"必須＋属性＋桁数＋登録","センター登録",null,"○","○",null,null,"3",{"$f":"IF($Z8=\"\",\"\",VLOOKUP($Z8,$AF$6:$AM$71,2,))","v":"送信先コード"},{"$f":"IF($Z8=\"\",\"\",VLOOKUP($Z8,$AF$6:$AM$71,5,))","v":9},{"$f":"IF($Z8=\"\",\"\",VLOOKUP($Z8,$AF$6:$AM$71,6,))","v":8},{"$f":"IF($Z8=\"\",\"\",VLOOKUP($Z8,$AF$6:$AM$71,7,))","v":0},null,"3","送信先コード",null,null,9,8,null,"◎"]
[null,null,"4","送信元コード",null,null,9,8,null,"◎","送信元(メーカ)","の統一取引先コード",null,null,null,null,null,null,"必須＋属性＋桁数＋登録","センター登録",null,"○","○",null,null,"4","送信元コード",9,8,0,null,"4","送信元コード",null,null,9,8,null,"◎"]
[null,null,"5","データ作成日",null,null,9,8,null,"◎","データ作成日付",null,"(西暦 YYYYMMDD)",null,null,null,null,null,null,"必須＋日付",null,"○","○",null,null,"5","データ作成日",9,8,0,null,"5","データ作成日",null,null,9,8,null,"○"]
[null,null,"6","データ作成時刻",null,null,9,6,null,null,"データ作成時刻",null,"(HHMMSS)",null,null,null,null,null,null,"時刻",null,"○","属性初期値","◎",null,null,"","","","",null,"6","対象期間（自）",null,null,9,8,null,"○"]
[null,null,"7","送信先名",null,null,"X",20,null,"○","送信元(卸)名 　          　",null,"(英数カナのみ)",null,null,null,null,null,"属性",null,null,"○","○",null,null,"10","送信先カナ名","X",20,0,null,"7","対象期間（至）",null,null,9,8,null,"○"]
[null,null,"8","送信元名",null,null,"X",20,null,"◎","送信先(メーカ)名          ",null,"(英数カナのみ)",null,null,null,null,null,"属性","必須",null,"○","○",null,null,"11","送信元カナ名","X",20,0,null,"8","請求先コード",null,null,9,8,null,"○"]
[null,null,"9","直接送信先コード",null,null,9,8,null,null,"送信先コードと異なる場合にセット          ",null,"(通常はゼロ)",null,null,null,null,null,null,"センター登録",null,"○","○",null,null,"14","直接送信先コード",9,8,0,null,"9","請求元コード",null,null,9,8,null,"○"]
[null,null,"10","直接送信先名",null,null,"X",20,null,null,"直接送信先名",null,"(英数カナのみ、通常はスペース)",null,null,null,null,null,"属性",null,null,"○","○",null,null,"15","直接送信先カナ名","X",20,0,null,"10","送信先カナ名",null,null,"X",20,null,"○"]
[null,null,"11","送信ファイルNO",null,null,9,2,null,null,"同時送信時の問合せ№",null,"(00～99)",null,null,null,null,null,null,"属性",null,"○","属性初期値","◎",null,null,"","","","",null,"11","送信元カナ名",null,null,"X",20,null,"○"]
[null,1.2,"12","伝送区分",null,null,"X",1,null,"○","請求データの 伝送区分",null,null,null,null,null,"1:全部送信\n2:違算分送信","△:無指定",null,"ｺｰﾄﾞ",null,"○","○",null,null,"16","伝送区分","X",1,0,null,"12","請求先カナ名",null,null,"X",20,null,"○"]
[null,1.2,"13","集計明細区分",null,null,"X",1,null,null,"請求データを明細または伝票集計での作成区分",null,null,null,null,null,"△:明細","1:集計",null,"ｺｰﾄﾞ\n※V1連携は\n\"1\"のみ可",null,"○","\"1\"固定","◎",null,null,"","","","",null,"13","請求元カナ名",null,null,"X",20,null,"○"]
[null,null,"14","対象期間（自）",null,null,9,8,null,"○","請求データの 対象期間（自）",null,"(西暦 YYYYMMDD)",null,null,null,null,null,null,"日付",null,"○","○",null,null,"6","対象期間（自）",9,8,0,null,"14","直接送信先コード",null,null,9,8]
[null,null,"15","対象期間（至）",null,null,9,8,null,"○","請求データの 対象期間（至）",null,"(西暦 YYYYMMDD)",null,null,null,null,null,null,"日付",null,"○","○",null,null,"7","対象期間（至）",9,8,0,null,"15","直接送信先カナ名",null,null,"X",20]
[null,null,"16","請求先コード",null,null,"X",13,null,"○","統一取引先コード(8桁)",null,null,null,null,null,null,null,"桁数",null,null,"○","前詰８桁＋空白５桁","○","属性＋桁数","8","請求先コード",9,8,0,null,"16","伝送区分",null,null,"X",1,null,"○"]
[null,null,"17","請求元コード",null,null,"X",13,null,"○","統一取引先コード(8桁)",null,null,null,null,null,null,null,"桁数",null,null,"○","前詰８桁＋空白５桁","○","属性＋桁数","9","請求元コード",9,8,0,null,"17","予備０１",null,null,"X",88]
[null,null,"18","請求元事業所コード",null,null,"X",13,null,null,"統一取引先コード(8桁)／プライベート・コード(3～8桁)／ＧＬＮ(13桁)",null,null,null,null,null,null,null,"桁数",null,null,"○","属性初期値","◎",null,null,"","","","",null,null,"明細部　　　　　　　　　　　　　　　　　　　　　　　　　　　　　　　　　　　　　　　　"]
[null,null,"19","請求先名",null,null,"X/N",40,null,"○","請求先名       ",null,"(英数カナは30文字、漢字は20文字)",null,null,null,null,null,null,null,null,"○","○","○","属性＋桁数","12","請求先カナ名","X",20,0,null,"18",null,"届け先コード",null,9,8,null,"○"]
[null,null,"20","請求元名",null,null,"X/N",40,null,"○","請求元名",null,"(英数カナは30文字、漢字は20文字)",null,null,null,null,null,null,null,null,"○","○","○","属性＋桁数","13","請求元カナ名","X",20,0,null,"19",null,"事業所コード",null,9,8]
[null,null,"21","請求元事業所名",null,null,"X/N",40,null,null,"事業所名",null,"(英数カナは30文字、漢字は20文字)",null,null,null,null,null,null,null,null,"○","属性初期値","◎",null,null,"","","","",null,"20",null,"登録店区分",null,"X",1,null,"○"]
[null,null,"22","取引先区分（請求先）",null,null,"X",1,null,null,"該当項目の取引先の属性区分",null,null,null,null,null,"△:統一取引先(8桁)",null,null,"ｺｰﾄﾞ",null,"○","属性初期値","◎",null,null,"","","","",null,"21",null,"請求支払区分",null,9,2,null,"○"]
[null,null,"23","取引先区分（請求元）",null,null,"X",1,null,null,"　　〃 ",null,null,null,null,null,"　　〃 ",null,null,"ｺｰﾄﾞ",null,"○","属性初期値","◎",null,null,"","","","",null,"22",null,"店入直送区分",null,9,1,null,"○"]
[null,null,"24","取引先区分（事業所）",null,null,"X",1,null,null,"　　〃 ",null,null,null,null,null,"△:  統一取引先(8桁)\n6:   GLN(13桁)\n7/8:プライベートコード(卸/ﾒｰｶ)",null,null,"ｺｰﾄﾞ",null,"○","属性初期値","◎",null,null,"","","","",null,"23",null,"取引コード",null,9,2,null,"○"]
[null,null,"25","日本語区分（請求先）",null,null,"X",1,null,null,"該当項目の日本語区分",null,null,null,null,null,"△/0:英数カナ\n1:　　漢字(S-JIS/JIS/JEF/IBM)",null,null,"ｺｰﾄﾞ",null,"○","属性初期値","◎",null,null,"","","","",null,"24",null,"メーカ伝票年月日",null,9,8,null,"○"]
[null,null,"26","日本語区分（請求元）",null,null,"X",1,null,null,"　　〃 ",null,null,null,null,null,"　　〃 ",null,null,"ｺｰﾄﾞ",null,"○","属性初期値","◎",null,null,"","","","",null,"25",null,"メーカ伝票NO",null,9,6,null,"○"]
[null,null,"27","日本語区分（事業所）",null,null,"X",1,null,null,"　　〃 ",null,null,null,null,null,"　　〃 ",null,null,"ｺｰﾄﾞ",null,"○","属性初期値","◎",null,null,"","","","",null,"26",null,"卸伝票年月日",null,9,8]
[null,1.2,"28","支払日",null,null,9,8,null,null,null,null,"(未使用)",null,null,null,null,null,null,null,null,"○","属性初期値","◎",null,null,"","","","",null,"27",null,"卸伝票NO",null,9,6,null,"○"]
[null,1.2,"29","支払予定時間",null,null,9,4,null,null,null,null,"(未使用)",null,null,null,null,null,null,null,null,"○","属性初期値","◎",null,null,"","","","",null,"28",null,"元伝年月日",null,9,8]
[null,null,"30","連携エリア",null,null,"X",20,null,null,"旧フォーマット予備連携データ",null,"(新フォーマット間：相対利用可能エリア)",null,null,null,null,null,null,null,null,"○","予備21～30バイト\n　→ 連携エリア1～10バイト\n予備84～88バイト\n　→ 連携エリア11～15バイト","◎",null,"17","予備０１","X",88,0,null,"29",null,"元伝NO",null,9,6]
[null,null,"31","卸発注伝票NO",null,null,9,8,null,"○","受発注データの卸伝票№",null,"(6桁→8桁に拡張、6桁運用の時は上２桁ゼロ埋め）",null,null,null,null,null,"属性＋桁数","属性",null,"○","予備上2桁(不正時\"00\")\n＋卸伝票NO","○","桁数","35\n27","予備０３\n卸伝票NO","X\n9","2\n6",0,null,"30",null,"請求金額符号",null,"X",1,null,"○"]
[null,null,"32","メーカ伝票NO",null,null,9,8,null,"○","メーカ発行伝票№",null,"(6桁→8桁に拡張、6桁運用の時は上２桁ゼロ埋め）",null,null,null,null,null,null,"属性",null,"○","○","○","桁数","25",{"$f":"IF($Z37=\"\",\"\",VLOOKUP($Z37,$AF$6:$AM$71,3,))","v":"メーカ伝票NO"},{"$f":"IF($Z37=\"\",\"\",VLOOKUP($Z37,$AF$6:$AM$71,5,))","v":9},{"$f":"IF($Z37=\"\",\"\",VLOOKUP($Z37,$AF$6:$AM$71,6,))","v":6},{"$f":"IF($Z37=\"\",\"\",VLOOKUP($Z37,$AF$6:$AM$71,7,))","v":0},null,"31",null,"請求金額",null,9,10,null,"○"]
[null,null,"33","店入直送区分",null,null,9,1,null,"○","店(倉)入れまたは直送等の区分",null,null,null,null,null,"1:店入\n2:直送\n","3:店引取\n4:直送引取",null,"ｺｰﾄﾞ",null,"○","○","○","ｺｰﾄﾞ","22","店入直送区分",9,1,0,null,"32",null,"二次店コード",null,9,8]
[null,2.7,"34","取引コード",null,null,9,2,null,"○","業界統一取引コード",null,null,null,null,null,"11:店入売上\n12:店入売上訂正\n21:店入返品\n22:店入返品訂正\n31:直送売上\n32:直送売上訂正\n\n\n\n","41:直送返品\n42:直送返品訂正\n51:割戻し金\n52:相殺\n81:ﾒｰｶｰ提供の役務\n91:卸提供の役務",null,"ｺｰﾄﾞ",null,"○","○",null,null,"23","取引コード",9,2,0,null,"33",null,"予備０２",null,"X",3]
[null,null,"35","卸伝票年月日",null,null,9,8,null,null,"納品年月日",null,"(西暦 YYYYMMDD)",null,null,null,null,null,"属性＋桁数","日付",null,"○","○",null,null,"26","卸伝票年月日",9,8,0,null,"34",null,"届け先カナ名",null,"X",30,null,"○"]
[null,null,"36","メーカ伝票年月日",null,null,9,8,null,"○","メーカ出荷日",null,"(西暦 YYYYMMDD)",null,null,null,null,null,"属性＋桁数","日付",null,"○","○",null,null,"24","メーカ伝票年月日",9,8,0,null,"35",null,"予備０３",null,"X",2]
[null,null,"37","倉庫コード",null,null,"X",4,null,null,null,null,"(未使用)",null,null,null,null,null,null,null,null,"○","属性初期値","◎",null,null,{"$f":"IF($Z42=\"\",\"\",VLOOKUP($Z42,$AF$6:$AM$71,2,))","v":""},"","","",null,"36","予備０４",null,null,"X",1]
[null,null,"38","出荷報告以外区分",null,null,"X",1,null,null,"請求と出荷報告との関係",null,null,null,null,null,"0:提供\n1:未提供","2:再請求\n△:無指定",null,"ｺｰﾄﾞ",null,"○","属性初期値","◎",null,null,{"$f":"IF($Z43=\"\",\"\",VLOOKUP($Z43,$AF$6:$AM$71,2,))","v":""},"","",""]
[null,null,"39","請求締日",null,null,9,8,null,null,"提供企業の請求最終締日",null,"(西暦 YYYYMMDD)",null,null,null,null,null,"属性＋桁数","日付",null,"○","属性初期値","◎",null,null,{"$f":"IF($Z44=\"\",\"\",VLOOKUP($Z44,$AF$6:$AM$71,2,))","v":""},"","",""]
[null,null,"40","請求口座",null,null,"X",10,null,null,"提供企業の請求口座コード",null,null,null,null,null,null,null,null,null,null,"○","属性初期値","◎",null,null,{"$f":"IF($Z45=\"\",\"\",VLOOKUP($Z45,$AF$6:$AM$71,2,))","v":""},"","",""]
[null,null,"41","請求支払区分",null,null,9,2,null,"○","請求・支払データのデータの発生区分",null,null,null,null,null,"00:今回分請求・支払\n10:前回分請求・今回未払分\n20:請求控除",null,null,"ｺｰﾄﾞ(請求)",null,"○","○",null,null,"21",{"$f":"IF($Z46=\"\",\"\",VLOOKUP($Z46,$AF$6:$AM$71,3,))","v":"請求支払区分"},9,2,0]
[null,null,"42","明細行数",null,null,9,2,null,null,"伝票内明細数",null,null,null,null,null,"00～06",null,null,"ｺｰﾄﾞ",null,"○","\"01\"固定","◎",null,null,"","","",""]
[null,null,"43","一次店コード",null,null,"X",13,null,null,"統一取引先コード(8桁)",null,null,null,null,null,null,null,"桁数",null,null,"○","前詰８桁＋空白５桁","○","名称+属性+桁数","19","事業所コード",9,8,0,null,"項番","　項目",null,null,"属性","整数桁","小数桁","必須"]
[null,null,"44","二次店コード",null,null,"X",13,null,null,"統一取引先コード(8桁)／プライベート・コード(3～8桁)／ＧＬＮ(13桁)",null,null,null,null,null,null,null,"桁数",null,null,"○","前詰８桁＋空白５桁","○","属性＋桁数","32","二次店コード",9,8,0]
[null,null,"45","三次店コード",null,null,"X",13,null,null,"統一取引先コード(8桁)／プライベート・コード(3～8桁)／ＧＬＮ(13桁)",null,null,null,null,null,null,null,"桁数",null,null,"○","属性初期値","◎",null,null,"","","","",null,"37","レコード件数",null,null,9,6,null,"○"]
[null,null,"46","届け先コード",null,null,"X",13,null,"○","統一取引先コード(8桁)／プライベート・コード(3～8桁)／ＧＬＮ(13桁)",null,null,null,null,null,null,null,"桁数",null,null,"○","前詰８桁＋空白５桁","○","属性＋桁数","18","届け先コード",9,8,0,null,"38","伝票枚数",null,null,9,6]
[null,null,"47","チェーン店コード",null,null,"X",13,null,null,"統一取引先コード(8桁)／プライベート・コード(3～8桁)／ＧＬＮ(13桁)",null,null,null,null,null,null,null,"桁数",null,null,"○","属性初期値","◎",null,null,"","","","",null,"39","前回請求残高符号",null,null,"X",1]
[null,null,"（次頁に続く）",null,null,null,null,null,null,null,null,null,null,null,null,null,null,null,null,null,null,null,null,null,null,null,null,null,null,null,null,"40","前回請求残高",null,null,9,11]
[null,null,null,null,null,null,null,null,null,null,null,null,null,null,null,null,null,null,null,null,null,null,null,null,null,null,null,null,null,null,null,"41","今回請求金額符号",null,null,"X",1]
[null,null,"　",null,null,null,null,null,null,null,null,null,null,null,null,null,null,null,null,null,null,null,null,null,null,null,null,null,null,null,null,"42","今回請求金額",null,null,9,11]
[null,null,null,null,null,null,null,null,null,null,null,null,null,null,null,null,null,null,null,null,null,null,null,null,null,null,null,null,null,null,null,"43","請求基本控除符号",null,null,"X",1]
[null,null,"（前頁の続き）",null,null,null,null,null,null,null,null,null,null,null,null,null,null,null,null,null,null,null,null,null,null,null,null,null,null,null,null,"44","請求基本控除",null,null,9,11]
[null,"変更","項番","　項目",null,null,"属性","整数桁","小数桁","必須","　項目説明",null,null,null,null,null,"　コード",null,"アップロード","V２ → Ｖ１･Ｖ２","Ｖ２→ Ｖ１","Ｖ２ ← Ｖ２","Ｖ２ ← Ｖ１","　　　　　　　Ｖ１フォーマット",null,null,null,null,null,null,null,"45","請求品種控除符号",null,null,"X",1]
[null,null,null,null,null,null,null,null,null,null,null,null,null,null,null,null,null,null,"チェック","センタチェック","センタチェック","コンバート","コンバート","比較・  変更点",null,"項番","　　項目","属性","整数","小数",null,"46","請求品種控除",null,null,9,11]
[null,null,"48","専用伝票日付",null,null,9,8,null,null,"納品伝票が専用伝票の場合にセット",null,"(西暦 YYYYMMDD)",null,null,null,null,null,null,"日付",null,"○","属性初期値","◎",null,null,{"$f":"IF($Z60=\"\",\"\",VLOOKUP($Z60,$AF$6:$AM$71,2,))","v":""},{"$f":"IF($Z60=\"\",\"\",VLOOKUP($Z60,$AF$6:$AM$71,5,))","v":""},{"$f":"IF($Z60=\"\",\"\",VLOOKUP($Z60,$AF$6:$AM$71,6,))","v":""},{"$f":"IF($Z60=\"\",\"\",VLOOKUP($Z60,$AF$6:$AM$71,7,))","v":""},null,"47","請求機能控除符号",null,null,"X",1]
[null,null,"49","専用伝票NO",null,null,9,9,null,null,"　　〃              　　　　    ",null,"(専用伝票№、左ゼロ埋め)",null,null,null,null,null,null,"属性",null,"○","属性初期値","◎",null,null,{"$f":"IF($Z61=\"\",\"\",VLOOKUP($Z61,$AF$6:$AM$71,2,))","v":""},"","","",null,"48","請求機能控除",null,null,9,11]
[null,null,"50","元伝年月日",null,null,9,8,null,null,"メーカで訂正した元伝票の納品日",null,"(西暦 YYYYMMDD)",null,null,null,null,null,null,"日付",null,"○","○",null,null,"28",{"$f":"IF($Z62=\"\",\"\",VLOOKUP($Z62,$AF$6:$AM$71,3,))","v":"元伝年月日"},9,8,0,null,"49","請求控除その他符号",null,null,"X",1]
[null,null,"51","元伝NO",null,null,9,8,null,null,"メーカで訂正した元伝票の伝票№",null,"(6桁運用の時は上２桁ゼロ埋め)",null,null,null,null,null,null,"属性",null,"○","○","○","桁数","29","元伝NO",9,6,0,null,"50","請求控除その他",null,null,9,11]
[null,null,"52","請求金額合計符号",null,null,"X",1,null,"○","請求合計金額の符号",null,null,null,null,null,"△/＋:正数","－:負数","属性","ｺｰﾄﾞ",null,"○","不正コード値 → \"△\"","◎",null,"30","請求金額符号","X",1,0,null,"51","請求消費税符号",null,null,"X",1]
[null,1.2,"53","請求金額合計",null,null,9,10,null,"○","請求合計金額",null,"(集計明細区分＝集計時は、請求金額と同値設定)",null,null,null,null,null,"属性＋桁数","属性",null,"○","○","◎",null,"31","請求金額",9,10,0,null,"52","請求消費税",null,null,9,10]
[null,null,"54","支払金額合計符号",null,null,"X",1,null,null,null,null,"(未使用)",null,null,null,null,null,null,null,null,"○","属性初期値","◎",null,null,"","","","",null,"53","請求金額合計符号",null,null,"X",1]
[null,1.2,"55","支払金額合計",null,null,9,10,null,null,null,null,"(未使用)",null,null,null,null,null,null,null,null,"○","属性初期値","◎",null,null,"","","","",null,"54","請求金額合計",null,null,9,11]
[null,null,"56","一次店名",null,null,"X/N",40,null,null,"一次店名",null,"(英数カナは30文字、漢字は20文字)",null,null,null,null,null,null,null,null,"○","属性初期値","◎",null,null,"","","","",null,"55","予備０５",null,null,"X",130]
[null,null,"57","二次店名",null,null,"X/N",40,null,null,"二次店名",null,"(英数カナは30文字、漢字は20文字)",null,null,null,null,null,null,null,null,"○","属性初期値","◎",null,null,"","","","",null,"56","改行コード",null,null,"X","2"]
[null,null,"58","三次店名",null,null,"X/N",40,null,null,"三次店名",null,"(英数カナは30文字、漢字は20文字)",null,null,null,null,null,null,null,null,"○","属性初期値","◎",null,null,"","","",""]
[null,null,"59","届け先名",null,null,"X/N",40,null,"○","届け先名",null,"(英数カナは30文字、漢字は20文字)",null,null,null,null,null,null,null,null,"○","○","○","属性＋桁数","34","届け先カナ名","X",30,0]
[null,null,"60","チェーン店名",null,null,"X/N",40,null,null,"チェーン店名",null,"(英数カナは30文字、漢字は20文字)",null,null,null,null,null,null,null,null,"○","属性初期値","◎",null,null,"","","",""]
[null,null,"61","電話番号",null,null,"X",15,null,null,"通常は届け先の電話番号  ",null,"(局番区切り(-)あり)",null,null,null,null,null,null,null,null,"○","属性初期値","◎",null,null,"","","",""]
[null,null,"62","住所",null,null,"X/N",80,null,null,"通常は届け先の住所         ",null,"(英数カナは60文字、漢字は40文字)",null,null,null,null,null,null,null,null,"○","属性初期値","◎",null,null,"","","",""]
[null,null,"63","摘要",null,null,"X/N",50,null,null,"伝票の摘要欄の内容",null,"(英数カナは50文字、漢字は25文字）",null,null,null,null,null,null,null,null,"○","属性初期値","◎",null,null,"","","",""]
[null,null,"64","メーカコード",null,null,"X",9,null,null,"７桁の場合は後ろスペース",null,"(49xxxxx / 45xxxxxxx)",null,null,null,null,null,null,null,null,"○","属性初期値","◎",null,null,"","","",""]
[null,null,"65","メーカ所属組織名",null,null,"X",10,null,null,"スペース",null,null,null,null,null,null,null,null,null,null,"○","属性初期値","◎",null,null,"","","",""]
[null,null,"66","伝票区分",null,null,9,1,null,null,null,null,"(未使用)",null,null,null,null,null,null,null,null,"○","属性初期値","◎",null,null,"","","",""]
[null,null,"67","登録店区分",null,null,"X",1,null,"○","メーカ登録店区分を指定",null,null,null,null,null,"0:登録店以外\n1:登録店","△:無指定",null,"ｺｰﾄﾞ",null,"○","○","○","ｺｰﾄﾞ","20","登録店区分","X",1,0]
[null,null,"68","定番特売区分",null,null,"X",1,null,null,"定番発注/特売発注の区分",null,null,null,null,null,"0:定番\n1:特売\n","△:分類不能",null,"ｺｰﾄﾞ",null,"○","属性初期値","◎",null,null,{"$f":"IF($Z80=\"\",\"\",VLOOKUP($Z80,$AF$6:$AM$71,2,))","v":""},"","",""]
[null,"2.1","69","消費税区分",null,null,"X",1,null,"○","税区分",null,null,null,null,null,"1:外税\n2:内税\n","3:非課税\n△:個別判断",null,"ｺｰﾄﾞ",null,"○","属性初期値","◎",null,null,"","","",""]
[null,"2.1","70","消費税率",null,null,9,2,1,"○","消費税の税率(99.9％)、ゼロ:個別判断　",null,null,"(小数点以下1桁)",null,null,null,null,"属性＋桁数","属性",null,"○","属性初期値","◎",null,null,"","","",""]
[null,null,"71","ロット不足運賃負担区分",null,null,"X",1,null,null,null,null,"(未使用)",null,null,null,null,null,null,null,null,"○","属性初期値","◎",null,null,"","","",""]
[null,null,"72","取引先区分（一次店）",null,null,"X",1,null,null,"該当項目の取引先の属性区分",null,null,null,null,null,"△:統一取引先(8桁)",null,null,"ｺｰﾄﾞ",null,"○","属性初期値","◎",null,null,"","","",""]
[null,null,"73","取引先区分（二次店）",null,null,"X",1,null,null,"　　〃 ",null,null,null,null,null,"△:  統一取引先(8桁)\n6:   GLN(13桁)\n7/8:プライベートコード(卸/ﾒｰｶ)",null,null,"ｺｰﾄﾞ",null,"○","属性初期値","◎",null,null,"","","",""]
[null,null,"74","取引先区分（三次店）",null,null,"X",1,null,null,"　　〃 ",null,null,null,null,null,"　　〃 ",null,null,"ｺｰﾄﾞ",null,"○","属性初期値","◎",null,null,"","","",""]
[null,null,"75","取引先区分（届け先）",null,null,"X",1,null,null,"　　〃 ",null,null,null,null,null,"　　〃 ",null,null,"ｺｰﾄﾞ",null,"○","属性初期値","◎",null,null,"","","",""]
[null,null,"76","取引先区分（チェーン店）",null,null,"X",1,null,null,"　　〃 ",null,null,null,null,null,"　　〃 ",null,null,"ｺｰﾄﾞ",null,"○","属性初期値","◎",null,null,"","","",""]
[null,null,"77","日本語区分（一次店）",null,null,"X",1,null,null,"該当項目の日本語区分",null,null,null,null,null,"△/0:英数カナ\n1:　　漢字(S-JIS/JIS/JEF/IBM)",null,null,"ｺｰﾄﾞ",null,"○","属性初期値","◎",null,null,"","","",""]
[null,null,"78","日本語区分（二次店）",null,null,"X",1,null,null,"　　〃 ",null,null,null,null,null,"　　〃 ",null,null,"ｺｰﾄﾞ",null,"○","属性初期値","◎",null,null,"","","",""]
[null,null,"79","日本語区分（三次店）",null,null,"X",1,null,null,"　　〃 ",null,null,null,null,null,"　　〃 ",null,null,"ｺｰﾄﾞ",null,"○","属性初期値","◎",null,null,"","","",""]
[null,null,"80","日本語区分（届け先）",null,null,"X",1,null,null,"　　〃 ",null,null,null,null,null,"　　〃 ",null,null,"ｺｰﾄﾞ",null,"○","属性初期値","◎",null,null,"","","",""]
[null,null,"81","日本語区分（チェーン店）",null,null,"X",1,null,null,"　　〃 ",null,null,null,null,null,"　　〃 ",null,null,"ｺｰﾄﾞ",null,"○","属性初期値","◎",null,null,"","","",""]
[null,null,"82","日本語区分（住所）",null,null,"X",1,null,null,"　　〃 ",null,null,null,null,null,"　　〃 ",null,null,"ｺｰﾄﾞ",null,"○","属性初期値","◎",null,null,"","","",""]
[null,null,"83","日本語区分（摘要）",null,null,"X",1,null,null,"　　〃 ",null,null,null,null,null,"　　〃 ",null,null,"ｺｰﾄﾞ",null,"○","属性初期値","◎",null,null,"","","",""]
[null,"2.6\n2.8","84","ヘッダー連携エリア",null,null,"X","20",null,null,"旧フォーマット予備連携データ",null,"(新フォーマット間：相対利用可能エリア)",null,null,null,null,null,null,null,null,"○","属性初期値","◎",null,null,"","","",""]
[null,null,null,"明細部　　　　　　　　　　　　　　　　　　　　　　　　　　　　　　　　　　　　　　　　",null,null,null,null,null,null,null,null,null,null,null,null,null,null,null,null,null,null,null,null,null,null,"","","",""]
[null,1.6,"85",null,"明細行NO",null,9,2,null,"◎*1\n","伝票内明細数",null,"(*1 集計明細区分＝明細時：必須＋コード チェック、\n  *2       〃          ＝集計時：属性 チェック  　　　　)",null,null,null,"01～06",null,null," *1 必須＋ｺｰﾄﾞ\n *2    属性   ",null,"○","”01”固定","◎",null,null,"","","",""]
[null,null,"86",null,"専用伝票行NO",null,9,2,null,null,"専用伝票の行№",null,"(00～99)",null,null,null,null,null,null,"属性",null,"○","属性初期値","◎",null,null,"","","",""]
[null,null,"87",null,"商品コード識別区分",null,9,1,null,null,"品番(商品コード)の識別区分",null,null,null,null,null,"0:統一商品コード\n1:ＩＴＦコード (14桁)\n3:JANコード    (標準:13桁)\n4:JANコード    (短縮:8桁)\n6:GTINコード  (14桁)",null,null,"ｺｰﾄﾞ",null,"○","”0”固定","◎",null,null,"","","",""]
[null,null,"88",null,"品番",null,"X",16,null,null,"統一商品ｺｰﾄﾞ､ITFｺｰﾄﾞ､JANｺｰﾄﾞ､GTINｺｰﾄﾞ",null,null,"(左詰め)",null,null,null,null,"属性",null,null,"○","ALL\"9\"固定","◎",null,null,"","","",""]
[null,null,"89",null,"商品名",null,"X/N",40,null,null,"商品名",null,"(英数カナは25文字、漢字は20文字)",null,null,null,null,null,null,null,null,"○","”ﾃﾞﾝﾋﾟﾖｳ ｼﾕｳｹｲ\"固定","◎",null,null,"","","",""]
[null,1.6,"90",null,"包装区分",null,9,1,null,"◎*1\n","数量の発注単位の区分",null,"(*1 集計明細区分＝明細時：必須＋コード チェック、\n  *2       〃          ＝集計時：属性 チェック  　　　　)\n(1:ケース発注時) (2:ボール発注時) (3:バラ発注時)",null,null,null,"1:ケース発注\n2:ボール発注\n","3:バラ発注",null," *1 必須＋ｺｰﾄﾞ\n *2    属性   ",null,"○","”1”固定","◎",null,null,"","","",""]
[null,null,"91",null,"内容","ボール内バラ数",9,4,2,null,"包装区分に準じた設定",null,"(ボール内バラ数","/ボール内バラ数","/ゼロ)",null,null,null,"属性＋桁数","属性",null,"○","属性初期値","◎",null,null,"","","",""]
[null,null,"92",null,null,"ケース内ボール数",9,2,null,null,"包装区分に準じた設定",null,"(ケース内ボール数","/ゼロ","/ゼロ)",null,null,null,"属性＋桁数","属性",null,"○","属性初期値","◎",null,null,"","","",""]
[null,null,"93",null,"数量符号",null,"X",1,null,"○","数量の符号",null,null,null,null,null,"△/＋:正数","－:負数","属性","ｺｰﾄﾞ",null,"○","不正コード値 → \"△\"","◎",null,"30",{"$f":"IF($Z106=\"\",\"\",VLOOKUP($Z106,$AF$6:$AM$71,3,))","v":"請求金額符号"},"X",1,0]
[null,null,"94",null,"数量","ケース数量",9,7,null,null,"包装区分に準じた設定",null,"(ケース数量","/ゼロ","/ゼロ)",null,null,null,"属性＋桁数","属性",null,"○","\"0000001\"固定","◎",null,null,{"$f":"IF($Z107=\"\",\"\",VLOOKUP($Z107,$AF$6:$AM$71,2,))","v":""},"","",""]
[null,null,"95",null,null,"ボール数量",9,7,null,null,"包装区分に準じた設定",null,"(ゼロ","/ボール数量","/ゼロ)",null,null,null,"属性＋桁数","属性",null,"○","属性初期値","◎",null,null,{"$f":"IF($Z108=\"\",\"\",VLOOKUP($Z108,$AF$6:$AM$71,2,))","v":""},"","",""]
[null,null,"96",null,null,"バラ数量",9,7,2,null,"包装区分に準じた設定",null,"(バラ数量","/バラ数量","バラ数量)",null,null,null,"属性＋桁数","属性",null,"○","属性初期値","◎",null,null,{"$f":"IF($Z109=\"\",\"\",VLOOKUP($Z109,$AF$6:$AM$71,2,))","v":""},"","",""]
[null,null,"97",null,"単価","請求単価",9,6,2,null,"請求単価",null,"(卸店入価格(バラ単価))",null,null,null,null,null,"属性＋桁数","属性",null,"○","\"00000100\"固定","◎",null,null,{"$f":"IF($Z110=\"\",\"\",VLOOKUP($Z110,$AF$6:$AM$71,2,))","v":""},"","",""]
[null,null,"98",null,null,"支払単価",9,6,2,null,"支払単価",null,"(卸店入価格(バラ単価))",null,null,null,null,null,"属性＋桁数","属性",null,"○","属性初期値","◎",null,null,{"$f":"IF($Z111=\"\",\"\",VLOOKUP($Z111,$AF$6:$AM$71,2,))","v":""},"","",""]
[null,1.2,"99",null,"請求金額符号",null,"X",1,null,"○","請求金額の符号",null,null,null,null,null,"△/＋:正数","－:負数","属性","ｺｰﾄﾞ",null,"○","不正コード値 → \"△\"",null,null,"30",{"$f":"IF($Z112=\"\",\"\",VLOOKUP($Z112,$AF$6:$AM$71,3,))","v":"請求金額符号"},"X",1,0]
[null,1.2,"100",null,"請求金額",null,9,10,null,"○","請求金額",null,"(卸店入価格換算)",null,null,null,null,null,"属性＋桁数","属性",null,"○","○",null,null,"31","請求金額",9,10,0]
[null,1.2,"101",null,"支払金額符号",null,"X",1,null,null,null,null,"(未使用)",null,null,null,null,null,null,null,null,"○","属性初期値","◎",null,null,{"$f":"IF($Z114=\"\",\"\",VLOOKUP($Z114,$AF$6:$AM$71,2,))","v":""},"","",""]
[null,1.2,"102",null,"支払金額",null,9,10,null,null,null,null,"(未使用)",null,null,null,null,null,null,null,null,"○","属性初期値","◎",null,null,{"$f":"IF($Z115=\"\",\"\",VLOOKUP($Z115,$AF$6:$AM$71,2,))","v":""},"","",""]
[null,null,"（次頁に続く）"]
[null,null,"　"]
[null,null,"　"]
[]
[null,null,"（前頁の続き）"]
[null,"変更","項番","　項目",null,null,"属性","整数桁","小数桁","必須","　項目説明",null,null,null,null,null,"　コード",null,"アップロード","V２ → Ｖ１･Ｖ２","Ｖ２→ Ｖ１","Ｖ２ ← Ｖ２","Ｖ２ ← Ｖ１","　　　　　　　Ｖ１フォーマット"]
[null,null,null,null,null,null,null,null,null,null,null,null,null,null,null,null,null,null,"チェック","センタチェック","センタチェック","コンバート","コンバート","比較・  変更点",null,"項番","　　項目","属性","整数","小数"]
[null,null,"103",null,"商品添付区分",null,"X",1,null,null,"添付商品扱いの区分",null,"(相対運用)",null,null,null,"△:売上げ\n1:現物添付","2:見本\n3:景品",null,"ｺｰﾄﾞ(新)",null,"○","属性初期値","◎",null,null,{"$f":"IF($Z123=\"\",\"\",VLOOKUP($Z123,$AF$6:$AM$71,2,))","v":""},{"$f":"IF($Z123=\"\",\"\",VLOOKUP($Z123,$AF$6:$AM$71,5,))","v":""},{"$f":"IF($Z123=\"\",\"\",VLOOKUP($Z123,$AF$6:$AM$71,6,))","v":""},{"$f":"IF($Z123=\"\",\"\",VLOOKUP($Z123,$AF$6:$AM$71,7,))","v":""}]
[null,null,"104",null,"支払区分",null,9,2,null,null,null,null,"(未使用)",null,null,null,null,null,null,null,null,"○","属性初期値","◎",null,null,"","","",""]
[null,null,"105",null,"入荷単位ケース数",null,9,2,null,null,"荷合せ品の場合の１梱包ケース数量を指定する",null,null,null,null,null,"00～20",null,"属性＋桁数","ｺｰﾄﾞ",null,"○","属性初期値","◎",null,null,"","","",""]
[null,null,"106",null,"単価計算区分",null,"X",1,null,null,"単価×数量の計算方法を指定する",null,"(小数点以下端数の計算処置方法)",null,null,null,"△:切捨て\n1:切上げ","2:四捨五入",null,"ｺｰﾄﾞ",null,"○","属性初期値","◎",null,null,"","","",""]
[null,null,"107",null,"卸発注行番号",null,9,2,null,null,"卸売業での発注伝票行NO",null,"(00～99)",null,null,null,null,null,null,"属性",null,"○","属性初期値","◎",null,null,"","","",""]
[null,"2.0","108",null,"資産譲渡日付区分",null,"X",1,null,null,"資産譲渡日付の形式区分",null,null,null,null,null,"△:年月日形式","1:年月形式",null,"ｺｰﾄﾞ",null,"○","属性初期値","◎",null,null,"","","",""]
[null,"2.6\n2.7","109",null,"資産譲渡日付",null,9,8,null,null,"資産譲渡日付                             (西暦 YYYYMMDD)\n※「資産譲渡日付区分」が『１：年月形式』の場合、「YYYYMM00」を設定",null,null,null,null,null,null,null,"属性＋桁数","日付",null,"○","属性初期値","◎",null,null,"","","",""]
[null,null,"110",null,"入庫許容日付区分",null,"X",1,null,null,null,null,"(未使用)",null,null,null,null,null,null,null,null,"○","属性初期値","◎",null,null,"","","",""]
[null,null,"111",null,"入庫許容日付",null,9,8,null,null,null,null,"(未使用)",null,null,null,null,null,null,null,null,"○","属性初期値","◎",null,null,"","","",""]
[null,null,"112",null,"実入庫製品日付区分",null,"X",1,null,null,null,null,"(未使用)",null,null,null,null,null,null,null,null,"○","属性初期値","◎",null,null,"","","",""]
[null,null,"113",null,"実入庫製品日付",null,9,8,null,null,null,null,"(未使用)",null,null,null,null,null,null,null,null,"○","属性初期値","◎",null,null,"","","",""]
[null,null,"114",null,"製造ロット番号",null,"X",10,null,null,null,null,"(未使用)",null,null,null,null,null,null,null,null,"○","属性初期値","◎",null,null,"","","",""]
[null,null,"115",null,"温度管理区分",null,"X",1,null,null,null,null,"(未使用)",null,null,null,null,null,null,null,null,"○","属性初期値","◎",null,null,"","","",""]
[null,null,"116",null,"製品容器区分",null,9,1,null,null,null,null,"(未使用)",null,null,null,null,null,null,null,null,"○","属性初期値","◎",null,null,"","","",""]
[null,null,"117",null,"外箱GTIN(ITF)コード",null,"X",14,null,null,null,null,"(未使用)",null,null,null,null,null,null,null,null,"○","属性初期値","◎",null,null,"","","",""]
[null,null,"118",null,"摘要",null,"X/N",50,null,null,"任意使用",null,"(英数カナは50文字、漢字は25文字)",null,null,null,null,null,null,null,null,"○","属性初期値","◎",null,null,"","","",""]
[null,null,"119",null,"日本語区分（商品名）",null,"X",1,null,null,"該当項目の日本語区分",null,null,null,null,null,"△/0:英数カナ\n1:　　漢字(S-JIS/JIS/JEF/IBM)",null,null,"ｺｰﾄﾞ",null,"○","属性初期値","◎",null,null,"","","",""]
[null,null,"120",null,"日本語区分（摘要）",null,"X",1,null,null,"　　〃 ",null,null,null,null,null,"　　〃 ",null,null,"ｺｰﾄﾞ",null,"○","属性初期値","◎",null,null,"","","",""]
[null,null,"121",null,"菓子業界商品分類コード",null,"X",6,null,null,"菓子業界の新商品分類コード",null,"(JICFSの機能分類コードとして登録)",null,null,null,null,null,null,null,null,"○","属性初期値","◎",null,null,"","","",""]
[null,null,"122",null,"割戻1","割戻計算区分","X",1,null,null,"割戻計算の小数点以下端数処理の計算区分",null,null,null,null,null,"△:切捨て\n1:切上げ","2:四捨五入",null,"ｺｰﾄﾞ",null,"○","属性初期値","◎",null,null,"","","",""]
[null,null,"123",null,null,"割戻区分","X",1,null,null,"割戻の条件区分",null,"(相対で設定)",null,null,null,null,null,null,null,null,"○","属性初期値","◎",null,null,"","","",""]
[null,null,"124",null,null,"割戻基準","X",1,null,null,"割戻の基準の区分",null,null,null,null,null,"△:割戻率\n1:割戻単価","2:割戻金額",null,"ｺｰﾄﾞ",null,"○","属性初期値","◎",null,null,"","","",""]
[null,null,"125",null,null,"割戻率／単価",9,4,2,null,"割戻率／割戻単価／金額の時はゼロ",null,"(小数点以下2桁)",null,null,null,null,null,"属性＋桁数","属性",null,"○","属性初期値","◎",null,null,"","","",""]
[null,null,"126",null,null,"割戻金額符号","X",1,null,null,"割戻金額の符号",null,null,null,null,null,"△/＋:正数","－:負数",null,"ｺｰﾄﾞ",null,"○","属性初期値","◎",null,null,"","","",""]
[null,null,"127",null,null,"割戻金額",9,9,null,null,"割戻計算結果を金額で指定",null,"(円単位)",null,null,null,null,null,"属性＋桁数","属性",null,"○","属性初期値","◎",null,null,"","","",""]
[null,null,"128",null,null,"割戻コード","X",5,null,null,"割戻の種類を表す",null,null,null,null,null,null,null,null,null,null,"○","属性初期値","◎",null,null,"","","",""]
[null,null,"129",null,"割戻2","割戻計算区分","X",1,null,null,"割戻1に同じ",null,null,null,null,null,"割戻1に同じ",null,null,"ｺｰﾄﾞ",null,"○","属性初期値","◎",null,null,"","","",""]
[null,null,"130",null,null,"割戻区分","X",1,null,null,null,null,null,null,null,null,null,null,null,null,null,"○","属性初期値","◎",null,null,"","","",""]
[null,null,"131",null,null,"割戻基準","X",1,null,null,null,null,null,null,null,null,null,null,null,"ｺｰﾄﾞ",null,"○","属性初期値","◎",null,null,"","","",""]
[null,null,"132",null,null,"割戻率／単価",9,4,2,null,null,null,null,null,null,null,null,null,"属性＋桁数","属性",null,"○","属性初期値","◎",null,null,"","","",""]
[null,null,"133",null,null,"割戻金額符号","X",1,null,null,null,null,null,null,null,null,null,null,null,"ｺｰﾄﾞ",null,"○","属性初期値","◎",null,null,"","","",""]
[null,null,"134",null,null,"割戻金額",9,9,null,null,null,null,null,null,null,null,null,null,"属性＋桁数","属性",null,"○","属性初期値","◎",null,null,"","","",""]
[null,null,"135",null,null,"割戻コード","X",5,null,null,null,null,null,null,null,null,null,null,null,null,null,"○","属性初期値","◎",null,null,"","","",""]
[null,null,"136",null,"割戻3","割戻計算区分","X",1,null,null,"割戻1に同じ",null,null,null,null,null,"割戻1に同じ",null,null,"ｺｰﾄﾞ",null,"○","属性初期値","◎",null,null,"","","",""]
[null,null,"137",null,null,"割戻区分","X",1,null,null,null,null,null,null,null,null,null,null,null,null,null,"○","属性初期値","◎",null,null,"","","",""]
[null,null,"138",null,null,"割戻基準","X",1,null,null,null,null,null,null,null,null,null,null,null,"ｺｰﾄﾞ",null,"○","属性初期値","◎",null,null,"","","",""]
[null,null,"139",null,null,"割戻率／単価",9,4,2,null,null,null,null,null,null,null,null,null,"属性＋桁数","属性",null,"○","属性初期値","◎",null,null,"","","",""]
[null,null,"140",null,null,"割戻金額符号","X",1,null,null,null,null,null,null,null,null,null,null,null,"ｺｰﾄﾞ",null,"○","属性初期値","◎",null,null,"","","",""]
[null,null,"141",null,null,"割戻金額",9,9,null,null,null,null,null,null,null,null,null,null,"属性＋桁数","属性",null,"○","属性初期値","◎",null,null,"","","",""]
[null,null,"142",null,null,"割戻コード","X",5,null,null,null,null,null,null,null,null,null,null,null,null,null,"○","属性初期値","◎",null,null,"","","",""]
[null,null,"143",null,"明細連携エリア",null,"X",10,null,null,"旧フォーマット予備連携データ",null,"(新フォーマット間：相対利用可能エリア)",null,null,null,null,null,null,null,null,"○","○","◎",null,"33",{"$f":"IF($Z163=\"\",\"\",VLOOKUP($Z163,$AF$6:$AM$71,3,))","v":"予備０２"},"X",3,0]
[null,"2.0","144","レコード件数",null,null,9,6,null,null,"レコードの総件数\n・データ送信側では、自身のフォーマットのレコード件数を設定する。\n・データ受信側では、当項目と実際のレコード件数の整合性チェックには利用しない。※下記【トレーラレコード連携時の留意事項】を参照のこと\n",null,null,null,null,null,null,null,"属性＋桁数","属性",null,"○","○",null,null,"37",{"$f":"IF($Z164=\"\",\"\",VLOOKUP($Z164,$AF$6:$AM$71,2,))","v":"レコード件数"},9,6,0]
[null,"2.0","145","伝票枚数",null,null,9,6,null,null,"伝票枚数（明細型：明細行NO=01の総数、集計型：ヘッダー/明細レコード件数＝レコード件数と同値）",null,null,null,null,null,null,null,"属性＋桁数","属性",null,"○","○",null,null,"38","伝票枚数",9,6,0]
[null,1.2,"146","前回請求残高符号",null,null,"X",1,null,null,"前回請求残高符号",null,null,null,null,null,"△/＋:正数","－:負数","属性","ｺｰﾄﾞ",null,"○","不正コード値 → \"△\"","○","コード","39","前回請求残高符号","X",1,0]
[null,1.2,"147","前回請求残高",null,null,9,11,null,null,"前回請求残高",null,"(税込み金額)",null,null,null,null,null,"属性＋桁数","属性",null,"○","○",null,null,"40","前回請求残高",9,11,0]
[null,"2.0","148","今回請求金額符号",null,null,"X",1,null,null,"今回請求金額符号",null,null,"※税率別内訳の集計値",null,null,"△/＋:正数","－:負数","属性","ｺｰﾄﾞ",null,"○","不正コード値 → \"△\"","○","コード","41","今回請求金額符号","X",1,0]
[null,"2.0","149","今回請求金額",null,null,9,11,null,null,"今回請求金額",null,"(税抜き金額)","※税率別内訳の集計値",null,null,null,null,"属性＋桁数","属性",null,"○","○",null,null,"42","今回請求金額",9,11,0]
[null,"2.0","150","請求基本控除符号",null,null,"X",1,null,null,"請求基本控除符号",null,null,"※税率別内訳の集計値",null,null,"△/＋:正数","－:負数","属性","ｺｰﾄﾞ",null,"○","不正コード値 → \"△\"","○","コード","43","請求基本控除符号","X",1,0]
[null,"2.0","151","請求基本控除",null,null,9,11,null,null,"請求基本控除",null,null,"※税率別内訳の集計値",null,null,null,null,"属性＋桁数","属性",null,"○","○",null,null,"44","請求基本控除",9,11,0]
[null,"2.0","152","請求品種控除符号",null,null,"X",1,null,null,"請求品種控除符号",null,null,"※税率別内訳の集計値",null,null,"△/＋:正数","－:負数","属性","ｺｰﾄﾞ",null,"○","不正コード値 → \"△\"","○","コード","45","請求品種控除符号","X",1,0]
[null,"2.0","153","請求品種控除",null,null,9,11,null,null,"請求品種控除",null,null,"※税率別内訳の集計値",null,null,null,null,"属性＋桁数","属性",null,"○","○",null,null,"46","請求品種控除",9,11,0]
[null,"2.0","154","請求機能控除符号",null,null,"X",1,null,null,"請求機能控除符号",null,null,"※税率別内訳の集計値",null,null,"△/＋:正数","－:負数","属性","ｺｰﾄﾞ",null,"○","不正コード値 → \"△\"","○","コード","47","請求機能控除符号","X",1,0]
[null,"2.0","155","請求機能控除",null,null,9,11,null,null,"請求機能控除",null,null,"※税率別内訳の集計値",null,null,null,null,"属性＋桁数","属性",null,"○","○",null,null,"48","請求機能控除",9,11,0]
[null,"2.0","156","請求控除その他符号",null,null,"X",1,null,null,"請求控除その他符号",null,null,"※税率別内訳の集計値",null,null,"△/＋:正数","－:負数","属性","ｺｰﾄﾞ",null,"○","不正コード値 → \"△\"","○","コード","49","請求控除その他符号","X",1,0]
[null,"2.0","157","請求控除その他",null,null,9,11,null,null,"請求控除その他",null,null,"※税率別内訳の集計値",null,null,null,null,"属性＋桁数","属性",null,"○","○",null,null,"50","請求控除その他",9,11,0]
[null,"2.0","158","請求消費税符号",null,null,"X",1,null,null,"請求消費税符号",null,null,"※税率別内訳の集計値",null,null,"△/＋:正数","－:負数","属性","ｺｰﾄﾞ",null,"○","不正コード値 → \"△\"","○","コード","51","請求消費税符号","X",1,0]
[null,"2.0","159","請求消費税",null,null,9,11,null,null,"請求消費税",null,null,"※税率別内訳の集計値",null,null,null,null,"属性＋桁数","属性",null,"○","○","○","桁数","52","請求消費税",9,10,0]
[null,"2.0","160","請求金額合計符号",null,null,"X",1,null,null,"請求金額合計符号",null,null,"※税率別内訳の集計値",null,null,"△/＋:正数","－:負数","属性","ｺｰﾄﾞ",null,"○","　　不正コード値 → \"△\"\n","○","コード","53","請求金額合計符号","X",1,0]
[null,2.2999999999999998,"161","請求金額合計",null,null,9,11,null,null,"請求金額合計",null,null,"※147＋税率別内訳の集計値",null,null,null,null,"属性＋桁数","属性",null,"○","○",null,null,"54","請求金額合計",9,11,0]
[null,null,"（次頁に続く）"]
[]
[null,null,"　"]
[]
[null,null,"（前頁の続き）"]
[null,"変更","項番","　項目",null,null,"属性","整数桁","小数桁","必須","　項目説明",null,null,null,null,null,"　コード",null,"アップロード","V２ → Ｖ１･Ｖ２","Ｖ２→ Ｖ１","Ｖ２ ← Ｖ２","Ｖ２ ← Ｖ１","　　　　　　　Ｖ１フォーマット"]
[null,null,null,null,null,null,null,null,null,null,null,null,null,null,null,null,null,null,"チェック","センタチェック","センタチェック","コンバート","コンバート","比較・  変更点",null,"項番","　　項目","属性","整数","小数"]
[null,1.2,"162","前回支払残高符号",null,null,"X",1,null,null,null,null,"(未使用)",null,null,null,null,null,null,null,null,"○","属性初期値","◎",null,null,{"$f":"IF($Z189=\"\",\"\",VLOOKUP($Z189,$AF$6:$AM$71,2,))","v":""},{"$f":"IF($Z189=\"\",\"\",VLOOKUP($Z189,$AF$6:$AM$71,5,))","v":""},{"$f":"IF($Z189=\"\",\"\",VLOOKUP($Z189,$AF$6:$AM$71,6,))","v":""},{"$f":"IF($Z189=\"\",\"\",VLOOKUP($Z189,$AF$6:$AM$71,7,))","v":""}]
[null,1.2,"163","前回支払残高",null,null,9,11,null,null,null,null,"(未使用)",null,null,null,null,null,null,null,null,"○","属性初期値","◎",null,null,"","","",""]
[null,1.2,"164","今回支払金額符号",null,null,"X",1,null,null,null,null,"(未使用)",null,null,null,null,null,null,null,null,"○","属性初期値","◎",null,null,"","","",""]
[null,1.2,"165","今回支払金額",null,null,9,11,null,null,null,null,"(未使用)",null,null,null,null,null,null,null,null,"○","属性初期値","◎",null,null,"","","",""]
[null,1.2,"166","支払基本控除符号",null,null,"X",1,null,null,null,null,"(未使用)",null,null,null,null,null,null,null,null,"○","属性初期値","◎",null,null,"","","",""]
[null,1.2,"167","支払基本控除",null,null,9,11,null,null,null,null,"(未使用)",null,null,null,null,null,null,null,null,"○","属性初期値","◎",null,null,"","","",""]
[null,1.2,"168","支払品種控除符号",null,null,"X",1,null,null,null,null,"(未使用)",null,null,null,null,null,null,null,null,"○","属性初期値","◎",null,null,"","","",""]
[null,1.2,"169","支払品種控除",null,null,9,11,null,null,null,null,"(未使用)",null,null,null,null,null,null,null,null,"○","属性初期値","◎",null,null,"","","",""]
[null,1.2,"170","支払機能控除符号",null,null,"X",1,null,null,null,null,"(未使用)",null,null,null,null,null,null,null,null,"○","属性初期値","◎",null,null,"","","",""]
[null,1.2,"171","支払機能控除",null,null,9,11,null,null,null,null,"(未使用)",null,null,null,null,null,null,null,null,"○","属性初期値","◎",null,null,"","","",""]
[null,1.2,"172","支払控除その他符号",null,null,"X",1,null,null,null,null,"(未使用)",null,null,null,null,null,null,null,null,"○","属性初期値","◎",null,null,"","","",""]
[null,1.2,"173","支払控除その他",null,null,9,11,null,null,null,null,"(未使用)",null,null,null,null,null,null,null,null,"○","属性初期値","◎",null,null,"","","",""]
[null,1.2,"174","支払消費税符号",null,null,"X",1,null,null,null,null,"(未使用)",null,null,null,null,null,null,null,null,"○","属性初期値","◎",null,null,"","","",""]
[null,1.2,"175","支払消費税",null,null,9,11,null,null,null,null,"(未使用)",null,null,null,null,null,null,null,null,"○","属性初期値","◎",null,null,"","","",""]
[null,1.2,"176","支払金額合計符号",null,null,"X",1,null,null,null,null,"(未使用)",null,null,null,null,null,null,null,null,"○","属性初期値","◎",null,null,"","","",""]
[null,1.2,"177","支払金額合計",null,null,9,11,null,null,null,null,"(未使用)",null,null,null,null,null,null,null,null,"○","属性初期値","◎",null,null,"","","",""]
[null,1.2,"178","連携エリア",null,null,"X",20,null,null,"旧フォーマット予備連携データ",null,"(新フォーマット間：相対利用可能エリア)",null,null,null,null,null,null,null,null,"○","○","◎",null,"55","予備０５","X",130,0]
[null,1.1000000000000001,"179","請求先カナ名",null,null,"X",30,null,null,"請求先(卸)","のカナ名称","(請求先名 に漢字を設定する場合、必須)",null,null,null,null,null,null,null,null,"○","属性初期値","◎",null,null,"","","",""]
[null,1.1000000000000001,"180","請求元カナ名",null,null,"X",30,null,null,"請求元(メーカ)","のカナ名称","(請求元名 に漢字を設定する場合、必須)",null,null,null,null,null,null,null,null,"○","属性初期値","◎",null,null,"","","",""]
[null,1.1000000000000001,"181","一次店カナ名",null,null,"X",30,null,null,"一次店カナ名",null,"(一次店名 に漢字を設定する場合、必須)",null,null,null,null,null,null,null,null,"○","属性初期値","◎",null,null,"","","",""]
[null,1.1000000000000001,"182","二次店カナ名",null,null,"X",30,null,null,"二次店カナ名",null,"(二次店名 に漢字を設定する場合、必須)",null,null,null,null,null,null,null,null,"○","属性初期値","◎",null,null,"","","",""]
[null,1.1000000000000001,"183","届け先カナ名",null,null,"X",30,null,null,"届け先カナ名",null,"(届け先名  に漢字を設定する場合、必須)",null,null,null,null,null,null,null,null,"○","属性初期値","◎",null,null,"","","",""]
[null,1.1000000000000001,"184","摘要カナ",null,null,"X",30,null,null,"摘要カナ",null,"(摘要        に漢字を設定する場合、必須)",null,null,null,null,null,null,null,null,"○","属性初期値","◎",null,null,"","","",""]
[null,1.1000000000000001,"185","商品名カナ",null,null,"X",25,null,null,"商品名カナ",null,"(商品名     に漢字を設定する場合、必須)",null,null,null,null,null,null,null,null,"○","属性初期値","◎",null,null,"","","",""]
[null,"2.0","186","登録番号",null,null,"X",14,null,null,"”T”＋法人番号13桁",null,"※2021.10以降、税務署への申告により取得のうえ設定",null,null,null,null,null,null,null,null,"○","属性初期値"]
[null,2.2999999999999998,null,{"$f":"\"税率別内訳１ ※未使用ブロックは全て空値(,,囲み)を設定する。\"","v":"税率別内訳１ ※未使用ブロックは全て空値(,,囲み)を設定する。"},null,null,null,null,null,null,"繰返部の設定順序は、軽減税率8%、標準税率10%、予備税率（卸提供の役務10%）"]
[null,"2.1\n2.0","187",null,"消費税率",null,9,2,1,null,"消費税の税率(99.9％)、ゼロ:個別判断　",null,null,"(小数点以下1桁)",null,null,null,null,"属性＋桁数","属性",null,"○","ALL SPACE","◎"]
[null,"2.1\n2.0","188",null,"今回請求金額符号",null,"X",1,null,null,"今回請求金額符号",null,null,null,null,null,"△/＋:正数","－:負数","属性","ｺｰﾄﾞ",null,"○",null,"◎"]
[null,"2.1\n2.0","189",null,"今回請求金額",null,9,11,null,null,"今回請求金額",null,"(税抜き金額)",null,null,null,null,null,"属性＋桁数","属性",null,"○",null,"◎"]
[null,"2.1\n2.0","190",null,"請求基本控除符号",null,"X",1,null,null,"請求基本控除符号",null,null,null,null,null,"△/＋:正数","－:負数","属性","ｺｰﾄﾞ",null,"○",null,"◎"]
[null,"2.1\n2.0","191",null,"請求基本控除",null,9,11,null,null,"請求基本控除",null,null,null,null,null,null,null,"属性＋桁数","属性",null,"○",null,"◎"]
[null,"2.1\n2.0","192",null,"請求品種控除符号",null,"X",1,null,null,"請求品種控除符号",null,null,null,null,null,"△/＋:正数","－:負数","属性","ｺｰﾄﾞ",null,"○",null,"◎"]
[null,"2.1\n2.0","193",null,"請求品種控除",null,9,11,null,null,"請求品種控除",null,null,null,null,null,null,null,"属性＋桁数","属性",null,"○",null,"◎"]
[null,"2.1\n2.0","194",null,"請求機能控除符号",null,"X",1,null,null,"請求機能控除符号",null,null,null,null,null,"△/＋:正数","－:負数","属性","ｺｰﾄﾞ",null,"○",null,"◎"]
[null,"2.1\n2.0","195",null,"請求機能控除",null,9,11,null,null,"請求機能控除",null,null,null,null,null,null,null,"属性＋桁数","属性",null,"○",null,"◎"]
[null,"2.1\n2.0","196",null,"請求控除その他符号",null,"X",1,null,null,"請求控除その他符号",null,null,null,null,null,"△/＋:正数","－:負数","属性","ｺｰﾄﾞ",null,"○",null,"◎"]
[null,"2.1\n2.0","197",null,"請求控除その他",null,9,11,null,null,"請求控除その他",null,null,null,null,null,null,null,"属性＋桁数","属性",null,"○",null,"◎"]
[null,"2.1\n2.0","198",null,"請求消費税符号",null,"X",1,null,null,"請求消費税符号",null,null,null,null,null,"△/＋:正数","－:負数","属性","ｺｰﾄﾞ",null,"○",null,"◎"]
[null,"2.1\n2.0","199",null,"請求消費税",null,9,11,null,null,"請求消費税",null,"(189 – 191 – 193 – 195 – 197) × 187",null,null,null,null,null,"属性＋桁数","属性",null,"○",null,"◎"]
[null,"2.1\n2.0","200",null,"税込請求金額符号",null,"X",1,null,null,"税込請求金額符号",null,null,null,null,null,"△/＋:正数","－:負数","属性","ｺｰﾄﾞ",null,"○",null,"◎"]
[null,"2.1\n2.0","201",null,"税込請求金額",null,9,11,null,null,"税込請求金額",null,"(189 – 191 – 193 – 195 – 197  ＋ 199)",null,null,null,null,null,"属性＋桁数","属性",null,"○",null,"◎"]
[null,"2.1\n2.0","202",null,"今回支払金額符号",null,"X",1,null,null,null,null,"(未使用)",null,null,null,null,null,null,null,null,"○",null,"◎"]
[null,"2.1\n2.0","203",null,"今回支払金額",null,9,11,null,null,null,null,"(未使用)",null,null,null,null,null,null,null,null,"○",null,"◎"]
[null,"2.1\n2.0","204",null,"支払基本控除符号",null,"X",1,null,null,null,null,"(未使用)",null,null,null,null,null,null,null,null,"○",null,"◎"]
[null,"2.1\n2.0","205",null,"支払基本控除",null,9,11,null,null,null,null,"(未使用)",null,null,null,null,null,null,null,null,"○",null,"◎"]
[null,"2.1\n2.0","206",null,"支払品種控除符号",null,"X",1,null,null,null,null,"(未使用)",null,null,null,null,null,null,null,null,"○",null,"◎"]
[null,"2.1\n2.0","207",null,"支払品種控除",null,9,11,null,null,null,null,"(未使用)",null,null,null,null,null,null,null,null,"○",null,"◎"]
[null,"2.1\n2.0","208",null,"支払機能控除符号",null,"X",1,null,null,null,null,"(未使用)",null,null,null,null,null,null,null,null,"○",null,"◎"]
[null,"2.1\n2.0","209",null,"支払機能控除",null,9,11,null,null,null,null,"(未使用)",null,null,null,null,null,null,null,null,"○",null,"◎"]
[null,"2.1\n2.0","210",null,"支払控除その他符号",null,"X",1,null,null,null,null,"(未使用)",null,null,null,null,null,null,null,null,"○",null,"◎"]
[null,"2.1\n2.0","211",null,"支払控除その他",null,9,11,null,null,null,null,"(未使用)",null,null,null,null,null,null,null,null,"○",null,"◎"]
[null,"2.1\n2.0","212",null,"支払消費税符号",null,"X",1,null,null,null,null,"(未使用)",null,null,null,null,null,null,null,null,"○",null,"◎"]
[null,"2.1\n2.0","213",null,"支払消費税",null,9,11,null,null,null,null,"(未使用)",null,null,null,null,null,null,null,null,"○",null,"◎"]
[null,"2.1\n2.0","214",null,"税込支払金額符号",null,"X",1,null,null,null,null,"(未使用)",null,null,null,null,null,null,null,null,"○",null,"◎"]
[null,"2.1\n2.0","215",null,"税込支払金額",null,9,11,null,null,null,null,"(未使用)",null,null,null,null,null,null,null,null,"○",null,"◎"]
[null,2.2999999999999998,null,{"$f":"\"税率別内訳２ ※未使用ブロックは全て空値(,,囲み)を設定する。\"","v":"税率別内訳２ ※未使用ブロックは全て空値(,,囲み)を設定する。"}]
[null,"2.1\n2.0",{"$f":"187+29 & \"～\"","v":"216～"}," ","※税別内訳１に同じ",null,null,null,null,null,null,null,null,null,null,null,null,null,null,null,null,null,"ALL SPACE"]
[null,"2.1\n2.0",{"$f":"215+29","v":244}]
[null,2.2999999999999998,null,{"$f":"\"税率別内訳３ ※未使用ブロックは全て空値(,,囲み)を設定する。\"","v":"税率別内訳３ ※未使用ブロックは全て空値(,,囲み)を設定する。"}]
[null,"2.1\n2.0",{"$f":"187+58 & \"～\"","v":"245～"}," ","※税別内訳１に同じ",null,null,null,null,null,null,null,null,null,null,null,null,null,null,null,null,null,"ALL SPACE"]
[null,"2.1\n2.0",{"$f":"215+58","v":273}]
[null,2.6,"274","登録番号2",null,null,"X","14",null,null,"”T”＋法人番号13桁",null,null,null,null,null,null,null,null,null,null,"○","属性初期値",null,null,null,"","","",""]
[null,2.8,"275","請求番号",null,null,"X","10",null,null,"請求番号",null,null,null,null,null,null,null,null,null,null,"○","属性初期値","◎",null,null,"","","",""]
[null,null,"276","改行コード",null,null,"X","2",null,null,"S-JISの改行コードを設定",null,null,null,null,null,null,null,null,null,null,null,null,null,null,null,"","","",""]
[]
[]
[null,null,null,null,null,null,null,null,null,null," ※ファイルの形式は、カンマ区切りの可変長形式となります。各項目の値にダブルクォート「\"」の囲みは不要です。"]
[null,null,null,null,null,null,null,null,null,null," ※画面から受信（ダウンロード）したファイルの最終行にはエンドレコードが出力されます。"]
[null,null,null,null,null,null,null,null,null,null,"　  エンドレコードのレイアウトは「エンドレコード」を参照してください。"]
[null,null,null,null,null,null,null,null,null,null," ※画面から送信（アップロード）するファイルにエンドレコードは不要です。"]

{"sheet":"３６支払明細","index":14,"n_rows":260,"n_cols":39,"rows_kept":260,"cut":false,"hidden":false,"merged":[[186,23,186,24],[185,23,185,27],[121,23,121,24],[57,23,57,27],[58,23,58,24],[120,23,120,27],[185,1,186,1],[185,2,186,2],[185,3,186,4],[185,6,186,6],[185,7,186,7],[185,8,186,8],[185,9,186,9],[185,10,186,10],[185,16,186,16],[163,10,163,15],[57,9,58,9],[120,1,121,1],[120,2,121,2],[120,3,121,4],[120,6,121,6],[120,7,121,7],[57,1,58,1],[57,2,58,2],[57,3,58,4],[57,6,58,6],[57,7,58,7],[57,8,58,8],[120,8,121,8],[120,9,121,9],[138,16,138,17],[84,16,84,17],[3,10,4,10],[57,10,58,10],[57,16,58,16],[88,16,88,17],[99,16,99,17],[26,16,26,17],[120,10,121,10],[120,16,121,16],[97,12,97,14],[102,12,102,14],[128,10,128,14],[48,38,49,38],[48,31,49,31],[48,32,49,33],[48,35,49,35],[48,36,49,36],[48,37,49,37],[3,38,4,38],[29,16,29,17],[4,23,4,24],[3,31,4,31],[3,32,4,33],[3,35,4,35],[3,36,4,36],[3,37,4,37],[3,23,3,27],[3,1,4,1],[3,3,4,4],[28,16,28,17],[45,16,45,17],[3,16,4,16],[3,2,4,2],[3,9,4,9],[3,6,4,6],[3,7,4,7],[3,8,4,8]]}
[null,null,null,null,null,null,null,null,null,null,null,null,null,null,null,null,null,null,null,null,null,null,null,null,null,null,null,null,null,null,null,null,{"$f":"シート別総ページ数","v":{"$error":"#NAME?"}}]
[null,null,"（７） Ｖ２・３６支払明細",null,null,null,null,null,null,null,null,null,null,null,null,null,null,null,null,null,null,null,null,null,null,null,null,null,null,null,null,"（５） Ｖ１・３４支払"]
[null,null,"　",null,null,null,null,null,null,null,null,null,null,null,null,null,null,null,null,null,null,null,null,null,null,null,null,null,null,null,null,"　"]
[null,"変更","項番","　項目",null,null,"属性","整数桁","小数桁","必須","　項目説明",null,null,null,null,null,"　コード",null,"アップロード","V２ → Ｖ１･Ｖ２","Ｖ２→ Ｖ１","Ｖ２ ← Ｖ２","Ｖ２ ← Ｖ１","　　　　　　　Ｖ１フォーマット",null,null,null,null,null,null,null,"項番","　項目",null,null,"属性","整数桁","小数桁","必須"]
[null,null,null,null,null,null,null,null,null,null,null,null,null,null,null,null,null,null,"チェック","センタチェック","センタチェック","コンバート","コンバート","比較・  変更点",null,"項番","　　項目","属性","整数","小数"]
[null,null,"1","データ種別",null,null,9,2,null,"◎","３６：支払(明細)データ",null,null,null,null,null,36,null,"必須","ｺｰﾄﾞ",null,"○","\"36\"固定","○","ｺｰﾄﾞ",null,{"$f":"IF($Z6=\"\",\"\",VLOOKUP($Z6,$AF$6:$AM$26,2,))","v":""},{"$f":"IF($Z6=\"\",\"\",VLOOKUP($Z6,$AF$6:$AM$26,6,))","v":""},{"$f":"IF($Z6=\"\",\"\",VLOOKUP($Z6,$AF$6:$AM$26,7,))","v":""},{"$f":"IF($Z6=\"\",\"\",VLOOKUP($Z6,$AF$6:$AM$26,8,))","v":""},null,"1","データ種別",null,null,9,2,null,"◎"]
[null,null,"2","最終トレーラ判定区分",null,null,"X",1,null,"◎","トレーラ判定の区分",null,null,null,null,null,"9:最終","△:それ以外",null,"ｺｰﾄﾞ",null,"○","○",null,null,"2",{"$f":"IF($Z7=\"\",\"\",VLOOKUP($Z7,$AF$6:$AM$89,2,))","v":"最終トレーラ判定区分"},{"$f":"IF($Z7=\"\",\"\",VLOOKUP($Z7,$AF$6:$AM$89,5,))","v":"X"},{"$f":"IF($Z7=\"\",\"\",VLOOKUP($Z7,$AF$6:$AM$89,6,))","v":1},{"$f":"IF($Z7=\"\",\"\",VLOOKUP($Z7,$AF$6:$AM$89,7,))","v":0},null,"2","最終トレーラ判定区分",null,null,"X",1,null,"◎"]
[null,null,"3","送信先コード",null,null,9,8,null,"◎","送信先(メーカ)","の統一取引先コード",null,null,null,null,null,null,"必須＋属性＋桁数＋登録","センター登録",null,"○","○",null,null,"3",{"$f":"IF($Z8=\"\",\"\",VLOOKUP($Z8,$AF$6:$AM$89,2,))","v":"送信先コード"},{"$f":"IF($Z8=\"\",\"\",VLOOKUP($Z8,$AF$6:$AM$89,5,))","v":9},{"$f":"IF($Z8=\"\",\"\",VLOOKUP($Z8,$AF$6:$AM$89,6,))","v":8},{"$f":"IF($Z8=\"\",\"\",VLOOKUP($Z8,$AF$6:$AM$89,7,))","v":0},null,"3","送信先コード",null,null,9,8,null,"◎"]
[null,null,"4","送信元コード",null,null,9,8,null,"◎","送信元(卸)     ","の統一取引先コード",null,null,null,null,null,null,"必須＋属性＋桁数＋登録","センター登録",null,"○","○",null,null,"4",{"$f":"IF($Z9=\"\",\"\",VLOOKUP($Z9,$AF$6:$AM$89,2,))","v":"送信元コード"},{"$f":"IF($Z9=\"\",\"\",VLOOKUP($Z9,$AF$6:$AM$89,5,))","v":9},{"$f":"IF($Z9=\"\",\"\",VLOOKUP($Z9,$AF$6:$AM$89,6,))","v":8},{"$f":"IF($Z9=\"\",\"\",VLOOKUP($Z9,$AF$6:$AM$89,7,))","v":0},null,"4","送信元コード",null,null,9,8,null,"◎"]
[null,null,"5","データ作成日",null,null,9,8,null,"◎","データ作成日付",null,"(西暦 YYYYMMDD)",null,null,null,null,null,null,"必須＋日付",null,"○","○",null,null,"5","データ作成日",9,8,0,null,"5","データ作成日",null,null,9,8,null,"○"]
[null,null,"6","データ作成時刻",null,null,9,6,null,null,"データ作成時刻",null,"(HHMMSS)",null,null,null,null,null,null,"時刻",null,"○","属性初期値","◎",null,null,"","","","",null,"6","対象期間（自）",null,null,9,8,null,"○"]
[null,null,"7","送信先名",null,null,"X",20,null,"○","送信先(メーカ)名          ",null,"(英数カナのみ)",null,null,null,null,null,"属性",null,null,"○","○",null,null,"10","送信先カナ名","X",20,0,null,"7","対象期間（至）",null,null,9,8,null,"○"]
[null,null,"8","送信元名",null,null,"X",20,null,"◎","送信元(卸)名 　          　",null,"(英数カナのみ)",null,null,null,null,null,"属性","必須",null,"○","○",null,null,"11","送信元カナ名","X",20,0,null,"8","支払先コード",null,null,9,8,null,"○"]
[null,null,"9","直接送信先コード",null,null,9,8,null,null,"送信先コードと異なる場合にセット          ",null,"(通常はゼロ)",null,null,null,null,null,null,"センター登録",null,"○","○",null,null,"14","直接送信先コード",9,8,0,null,"9","支払元コード",null,null,9,8,null,"○"]
[null,null,"10","直接送信先名",null,null,"X",20,null,null,"直接送信先名",null,"(英数カナのみ、通常はスペース)",null,null,null,null,null,"属性",null,null,"○","○",null,null,"15","直接送信先カナ名","X",20,0,null,"10","送信先カナ名",null,null,"X",20,null,"○"]
[null,null,"11","送信ファイルNO",null,null,9,2,null,null,"同時送信時の問合せ№",null,"(00～99)",null,null,null,null,null,null,"属性",null,"○","属性初期値","◎",null,null,"","","","",null,"11","送信元カナ名",null,null,"X",20,null,"○"]
[null,1.2,"12","伝送区分",null,null,"X",1,null,"○","請求データの 伝送区分",null,null,null,null,null,"1:全部送信\n2:違算分送信","△:無指定",null,"ｺｰﾄﾞ",null,"○","○",null,null,"16","伝送区分","X",1,0,null,"12","支払先カナ名",null,null,"X",20,null,"○"]
[null,1.2,"13","集計明細区分",null,null,"X",1,null,null,"請求データを明細または伝票集計での作成区分",null,null,null,null,null,"△:明細","1:集計",null,"ｺｰﾄﾞ\n※V1連携は\n\"1\"のみ可",null,"○","\"1\"固定","◎",null,null,"","","","",null,"13","支払元カナ名",null,null,"X",20,null,"○"]
[null,null,"14","対象期間（自）",null,null,9,8,null,"○","請求データの 対象期間（自）",null,"(西暦 YYYYMMDD)",null,null,null,null,null,null,"日付",null,"○","○",null,null,"6","対象期間（自）",9,8,0,null,"14","直接送信先コード",null,null,9,8]
[null,null,"15","対象期間（至）",null,null,9,8,null,"○","請求データの 対象期間（至）",null,"(西暦 YYYYMMDD)",null,null,null,null,null,null,"日付",null,"○","○",null,null,"7","対象期間（至）",9,8,0,null,"15","直接送信先カナ名",null,null,"X",20]
[null,null,"16","支払元コード",null,null,"X",13,null,"○","統一取引先コード(8桁)",null,null,null,null,null,null,null,"桁数",null,null,"○","前詰８桁＋空白５桁","○","属性＋桁数","9","支払元コード",9,8,0,null,"16","伝送区分",null,null,"X",1,null,"○"]
[null,null,"17","支払先コード",null,null,"X",13,null,"○","統一取引先コード(8桁)",null,null,null,null,null,null,null,"桁数",null,null,"○","前詰８桁＋空白５桁","○","属性＋桁数","8","支払先コード",9,8,0,null,"17","支払日",null,null,9,8]
[null,null,"18","支払先事業所コード",null,null,"X",13,null,null,"統一取引先コード(8桁)／プライベート・コード(3～8桁)／ＧＬＮ(13桁)",null,null,null,null,null,null,null,"桁数",null,null,"○","属性初期値","◎",null,null,"","","","",null,"18","予備０１",null,null,"X",80]
[null,null,"19","支払元名",null,null,"X/N",40,null,"○","支払元名",null,"(英数カナは30文字、漢字は20文字)",null,null,null,null,null,null,null,null,"○","○","○","属性＋桁数","13","支払元カナ名","X",20,0,null,null,"明細部　　　　　　　　　　　　　　　　　　　　　　　　　　　　　　　　　　　　　　　　"]
[null,null,"20","支払先名",null,null,"X/N",40,null,"○","支払先名",null,"(英数カナは30文字、漢字は20文字)",null,null,null,null,null,null,null,null,"○","○","○","属性＋桁数","12","支払先カナ名","X",20,0,null,"19",null,"届け先コード",null,9,8,null,"○"]
[null,null,"21","支払先事業所名",null,null,"X/N",40,null,null,"事業所名",null,"(英数カナは30文字、漢字は20文字)",null,null,null,null,null,null,null,null,"○","属性初期値","◎",null,null,"","","","",null,"20",null,"事業所コード",null,9,8]
[null,null,"22","取引先区分（支払元）",null,null,"X",1,null,null,"該当項目の取引先の属性区分",null,null,null,null,null,"△:統一取引先(8桁)",null,null,"ｺｰﾄﾞ",null,"○","属性初期値","◎",null,null,"","","","",null,"21",null,"登録店区分",null,"X",1,null,"○"]
[null,null,"23","取引先区分（支払先）",null,null,"X",1,null,null,"　　〃 ",null,null,null,null,null,"　　〃 ",null,null,"ｺｰﾄﾞ",null,"○","属性初期値","◎",null,null,"","","","",null,"22",null,"請求支払区分",null,9,2,null,"○"]
[null,null,"24","取引先区分（事業所）",null,null,"X",1,null,null,"　　〃 ",null,null,null,null,null,"△:  統一取引先(8桁)\n6:   GLN(13桁)\n7/8:プライベートコード(卸/ﾒｰｶ)",null,null,"ｺｰﾄﾞ",null,"○","属性初期値","◎",null,null,"","","","",null,"23",null,"店入直送区分",null,9,1,null,"○"]
[null,null,"25","日本語区分（支払元）",null,null,"X",1,null,null,"該当項目の日本語区分",null,null,null,null,null,"△/0:英数カナ\n1:　　漢字(S-JIS/JIS/JEF/IBM)",null,null,"ｺｰﾄﾞ",null,"○","属性初期値","◎",null,null,"","","","",null,"24",null,"取引コード",null,9,2,null,"○"]
[null,null,"26","日本語区分（支払先）",null,null,"X",1,null,null,"　　〃 ",null,null,null,null,null,"　　〃 ",null,null,"ｺｰﾄﾞ",null,"○","属性初期値","◎",null,null,"","","","",null,"25",null,"メーカ伝票年月日",null,9,8,null,"○"]
[null,null,"27","日本語区分（事業所）",null,null,"X",1,null,null,"　　〃 ",null,null,null,null,null,"　　〃 ",null,null,"ｺｰﾄﾞ",null,"○","属性初期値","◎",null,null,"","","","",null,"26",null,"メーカ伝票NO",null,9,6,null,"○"]
[null,1.2,"28","支払日",null,null,9,8,null,null,"支払予定日",null,"(西暦 YYYYMMDD)",null,null,null,null,null,null,"日付",null,"○","○","◎",null,"17","支払日",9,8,0,null,"27",null,"卸伝票年月日",null,9,8,null,"○"]
[null,1.2,"29","支払予定時間",null,null,9,4,null,null,null,null,"(未使用)",null,null,null,null,null,null,null,null,"○","属性初期値","◎",null,null,"","","","",null,"28",null,"卸伝票NO",null,9,6,null,"○"]
[null,null,"30","連携エリア",null,null,"X",20,null,null,"旧フォーマット予備連携データ",null,"(新フォーマット間：相対利用可能エリア)",null,null,null,null,null,null,null,null,"○","○","◎",null,"18","予備０１","X",80,0,null,"29",null,"元伝年月日",null,9,8]
[null,null,"31","卸発注伝票NO",null,null,9,8,null,"○","受発注データの卸伝票№",null,"(6桁→8桁に拡張、6桁運用の時は上２桁ゼロ埋め）",null,null,null,null,null,"属性＋桁数","属性",null,"○","予備上2桁(不正時\"00\")\n＋卸伝票NO","○","桁数","36\n28","予備０２\n卸伝票NO","X\n9","2\n8",0,null,"30",null,"元伝NO",null,9,6]
[null,null,"32","メーカ伝票NO",null,null,9,8,null,"○","メーカ発行伝票№",null,"(6桁→8桁に拡張、6桁運用の時は上２桁ゼロ埋め）",null,null,null,null,null,null,"属性",null,"○","○","○","桁数","26",{"$f":"IF($Z37=\"\",\"\",VLOOKUP($Z37,$AF$6:$AM$89,3,))","v":"メーカ伝票NO"},9,6,0,null,"31",null,"請求金額符号",null,"X",1,null,"○"]
[null,null,"33","店入直送区分",null,null,9,1,null,"○","店(倉)入れまたは直送等の区分",null,null,null,null,null,"1:店入\n2:直送\n","3:店引取\n4:直送引取",null,"ｺｰﾄﾞ",null,"○","○","○","ｺｰﾄﾞ","23","店入直送区分",9,1,0,null,"32",null,"請求金額",null,9,10,null,"○"]
[null,2.7,"34","取引コード",null,null,9,2,null,"○","業界統一取引コード",null,null,null,null,null,"11:店入売上\n12:店入売上訂正\n21:店入返品\n22:店入返品訂正\n31:直送売上\n32:直送売上訂正\n\n\n\n","41:直送返品\n42:直送返品訂正\n51:割戻し金\n52:相殺\n81:ﾒｰｶｰ提供の役務\n91:卸提供の役務",null,"ｺｰﾄﾞ",null,"○","○",null,null,"24","取引コード",9,2,0,null,"33",null,"支払金額符号",null,"X",1,null,"○"]
[null,null,"35","卸伝票年月日",null,null,9,8,null,"○","納品年月日",null,"(西暦 YYYYMMDD)",null,null,null,null,null,"属性＋桁数","日付",null,"○","○",null,null,"27","卸伝票年月日",9,8,0,null,"34",null,"支払金額",null,9,10,null,"○"]
[null,null,"36","メーカ伝票年月日",null,null,9,8,null,"○","メーカ出荷日",null,"(西暦 YYYYMMDD)",null,null,null,null,null,"属性＋桁数","日付",null,"○","○",null,null,"25","メーカ伝票年月日",9,8,0,null,"35",null,"届け先カナ名",null,"X",30,null,"○"]
[null,null,"37","倉庫コード",null,null,"X",4,null,null,null,null,"(未使用)",null,null,null,null,null,null,null,null,"○","属性初期値","◎",null,null,"","","","",null,"36",null,"予備０２",null,"X",2]
[null,null,"38","出荷報告以外区分",null,null,"X",1,null,null,"請求と出荷報告との関係",null,null,null,null,null,"0:提供\n1:未提供","2:再請求\n△:無指定",null,"ｺｰﾄﾞ",null,"○","属性初期値","◎",null,null,"","","","",null,"37","予備０３",null,null,"X",1]
[null,null,"39","請求締日",null,null,9,8,null,null,"提供企業の請求最終締日",null,"(西暦 YYYYMMDD)",null,null,null,null,null,"属性＋桁数","日付",null,"○","属性初期値","◎",null,null,"","","",""]
[null,null,"40","請求口座",null,null,"X",10,null,null,"提供企業の請求口座コード",null,null,null,null,null,null,null,null,null,null,"○","属性初期値","◎",null,null,"","","",""]
[null,null,"41","請求支払区分",null,null,9,2,null,"○","請求・支払データのデータの発生区分",null,null,null,null,null,"00:今回分請求・支払\n10:前回分請求・今回未払分\n20:請求控除",null,null,"ｺｰﾄﾞ(請求)",null,"○","○",null,null,"22","請求支払区分",9,2,0]
[null,null,"42","明細行数",null,null,9,2,null,null,"伝票内明細数",null,null,null,null,null,"00～06",null,null,"ｺｰﾄﾞ",null,"○","\"01\"固定","◎",null,null,"","","",""]
[null,null,"43","一次店コード",null,null,"X",13,null,null,"統一取引先コード(8桁)",null,null,null,null,null,null,null,"桁数",null,null,"○","前詰８桁＋空白５桁","○","名称+属性+桁数","20","事業所コード",9,8,0]
[null,null,"44","二次店コード",null,null,"X",13,null,null,"統一取引先コード(8桁)／プライベート・コード(3～8桁)／ＧＬＮ(13桁)",null,null,null,null,null,null,null,"桁数",null,null,"○","属性初期値","◎",null,null,"","","","",null,"項番","　項目",null,null,"属性","整数桁","小数桁","必須"]
[null,null,"45","三次店コード",null,null,"X",13,null,null,"統一取引先コード(8桁)／プライベート・コード(3～8桁)／ＧＬＮ(13桁)",null,null,null,null,null,null,null,"桁数",null,null,"○","属性初期値","◎",null,null,"","","",""]
[null,null,"46","届け先コード",null,null,"X",13,null,"○","統一取引先コード(8桁)／プライベート・コード(3～8桁)／ＧＬＮ(13桁)",null,null,null,null,null,null,null,"桁数",null,null,"○","前詰８桁＋空白５桁","○","属性＋桁数","19","届け先コード",9,8,0,null,"38","レコード件数",null,null,9,6,null,"○"]
[null,null,"47","チェーン店コード",null,null,"X",13,null,null,"統一取引先コード(8桁)／プライベート・コード(3～8桁)／ＧＬＮ(13桁)",null,null,null,null,null,null,null,"桁数",null,null,"○","属性初期値","◎",null,null,"","","","",null,"39","伝票枚数",null,null,9,6]
[null,null,"（次頁に続く）",null,null,null,null,null,null,null,null,null,null,null,null,null,null,null,null,null,null,null,null,null,null,null,null,null,null,null,null,"40","前回請求残高符号",null,null,"X",1]
[null,null,null,null,null,null,null,null,null,null,null,null,null,null,null,null,null,null,null,null,null,null,null,null,null,null,null,null,null,null,null,"41","前回請求残高",null,null,9,11]
[null,null,"　",null,null,null,null,null,null,null,null,null,null,null,null,null,null,null,null,null,null,null,null,null,null,null,null,null,null,null,null,"42","今回請求金額符号",null,null,"X",1]
[null,null,null,null,null,null,null,null,null,null,null,null,null,null,null,null,null,null,null,null,null,null,null,null,null,null,null,null,null,null,null,"43","今回請求金額",null,null,9,11]
[null,null,"（前頁の続き）",null,null,null,null,null,null,null,null,null,null,null,null,null,null,null,null,null,null,null,null,null,null,null,null,null,null,null,null,"44","請求基本控除符号",null,null,"X",1]
[null,"変更","項番","　項目",null,null,"属性","整数桁","小数桁","必須","　項目説明",null,null,null,null,null,"　コード",null,"アップロード","V２ → Ｖ１･Ｖ２","Ｖ２→ Ｖ１","Ｖ２ ← Ｖ２","Ｖ２ ← Ｖ１","　　　　　　　Ｖ１フォーマット",null,null,null,null,null,null,null,"45","請求基本控除",null,null,9,11]
[null,null,null,null,null,null,null,null,null,null,null,null,null,null,null,null,null,null,"チェック","センタチェック","センタチェック","コンバート","コンバート","比較・  変更点",null,"項番","　　項目","属性","整数","小数",null,"46","請求品種控除符号",null,null,"X",1]
[null,null,"48","専用伝票日付",null,null,9,8,null,null,"納品伝票が専用伝票の場合にセット",null,"(西暦 YYYYMMDD)",null,null,null,null,null,null,"日付",null,"○","属性初期値","◎",null,null,{"$f":"IF($Z60=\"\",\"\",VLOOKUP($Z60,$AF$6:$AM$89,2,))","v":""},{"$f":"IF($Z60=\"\",\"\",VLOOKUP($Z60,$AF$6:$AM$89,5,))","v":""},{"$f":"IF($Z60=\"\",\"\",VLOOKUP($Z60,$AF$6:$AM$89,6,))","v":""},{"$f":"IF($Z60=\"\",\"\",VLOOKUP($Z60,$AF$6:$AM$89,7,))","v":""},null,"47","請求品種控除",null,null,9,11]
[null,null,"49","専用伝票NO",null,null,9,9,null,null,"　　〃              　　　　    ",null,"(専用伝票№、左ゼロ埋め)",null,null,null,null,null,null,"属性",null,"○","属性初期値","◎",null,null,{"$f":"IF($Z61=\"\",\"\",VLOOKUP($Z61,$AF$6:$AM$89,2,))","v":""},"","","",null,"48","請求機能控除符号",null,null,"X",1]
[null,null,"50","元伝年月日",null,null,9,8,null,null,"メーカで訂正した元伝票の納品日",null,"(西暦 YYYYMMDD)",null,null,null,null,null,null,"日付",null,"○","○",null,null,"29",{"$f":"IF($Z62=\"\",\"\",VLOOKUP($Z62,$AF$6:$AM$89,3,))","v":"元伝年月日"},9,8,0,null,"49","請求機能控除",null,null,9,11]
[null,null,"51","元伝NO",null,null,9,8,null,null,"メーカで訂正した元伝票の伝票№",null,"(6桁運用の時は上２桁ゼロ埋め)",null,null,null,null,null,null,"属性",null,"○","○","○","桁数","30","元伝NO",9,6,0,null,"50","請求控除その他符号",null,null,"X",1]
[null,null,"52","請求金額合計符号",null,null,"X",1,null,"○","請求合計金額の符号",null,null,null,null,null,"△/＋:正数","－:負数","属性","ｺｰﾄﾞ",null,"○","不正コード値 → \"△\"","◎",null,"31","請求金額符号","X",1,0,null,"51","請求控除その他",null,null,9,11]
[null,1.2,"53","請求金額合計",null,null,9,10,null,"○","請求合計金額",null,"(集計明細区分＝集計時は、請求金額と同値設定)",null,null,null,null,null,"属性＋桁数","属性",null,"○","○","◎",null,"32","請求金額",9,10,0,null,"52","請求消費税符号",null,null,"X",1]
[null,null,"54","支払金額合計符号",null,null,"X",1,null,"○","支払合計金額の符号",null,null,null,null,null,"△/＋:正数","－:負数","属性","ｺｰﾄﾞ",null,"○","不正コード値 → \"△\"","◎",null,"33","支払金額符号","X",1,0,null,"53","請求消費税",null,null,9,10]
[null,1.2,"55","支払金額合計",null,null,9,10,null,"○","支払合計金額",null,"(集計明細区分＝集計時は、支払金額と同値設定)",null,null,null,null,null,"属性＋桁数","属性",null,"○","○","◎",null,"34","支払金額",9,10,0,null,"54","請求金額合計符号",null,null,"X",1]
[null,null,"56","一次店名",null,null,"X/N",40,null,null,"一次店名",null,"(英数カナは30文字、漢字は20文字)",null,null,null,null,null,null,null,null,"○","属性初期値","◎",null,null,"","","","",null,"55","請求金額合計",null,null,9,11]
[null,null,"57","二次店名",null,null,"X/N",40,null,null,"二次店名",null,"(英数カナは30文字、漢字は20文字)",null,null,null,null,null,null,null,null,"○","属性初期値","◎",null,null,"","","","",null,"56","前回支払残高符号",null,null,"X",1]
[null,null,"58","三次店名",null,null,"X/N",40,null,null,"三次店名",null,"(英数カナは30文字、漢字は20文字)",null,null,null,null,null,null,null,null,"○","属性初期値","◎",null,null,"","","","",null,"57","前回支払残高",null,null,9,11]
[null,null,"59","届け先名",null,null,"X/N",40,null,"○","届け先名",null,"(英数カナは30文字、漢字は20文字)",null,null,null,null,null,null,null,null,"○","○","○","属性＋桁数","35","届け先カナ名","X",30,0,null,"58","今回支払金額符号",null,null,"X",1]
[null,null,"60","チェーン店名",null,null,"X/N",40,null,null,"チェーン店名",null,"(英数カナは30文字、漢字は20文字)",null,null,null,null,null,null,null,null,"○","属性初期値","◎",null,null,"","","","",null,"59","今回支払金額",null,null,9,11]
[null,null,"61","電話番号",null,null,"X",15,null,null,"通常は届け先の電話番号  ",null,"(局番区切り(-)あり)",null,null,null,null,null,null,null,null,"○","属性初期値","◎",null,null,"","","","",null,"60","支払基本控除符号",null,null,"X",1]
[null,null,"62","住所",null,null,"X/N",80,null,null,"通常は届け先の住所         ",null,"(英数カナは60文字、漢字は40文字)",null,null,null,null,null,null,null,null,"○","属性初期値","◎",null,null,"","","","",null,"61","支払基本控除",null,null,9,11]
[null,null,"63","摘要",null,null,"X/N",50,null,null,"伝票の摘要欄の内容",null,"(英数カナは50文字、漢字は25文字）",null,null,null,null,null,null,null,null,"○","属性初期値","◎",null,null,"","","","",null,"62","支払品種控除符号",null,null,"X",1]
[null,null,"64","メーカーコード",null,null,"X",9,null,null,"７桁の場合は後ろスペース",null,"(49xxxxx / 45xxxxxxx)",null,null,null,null,null,null,null,null,"○","属性初期値","◎",null,null,"","","","",null,"63","支払品種控除",null,null,9,11]
[null,null,"65","メーカ所属組織名",null,null,"X",10,null,null,"スペース",null,null,null,null,null,null,null,null,null,null,"○","属性初期値","◎",null,null,"","","","",null,"64","支払機能控除符号",null,null,"X",1]
[null,null,"66","伝票区分",null,null,9,1,null,null,null,null,"(未使用)",null,null,null,null,null,null,null,null,"○","属性初期値","◎",null,null,"","","","",null,"65","支払機能控除",null,null,9,11]
[null,null,"67","登録店区分",null,null,"X",1,null,"○","メーカ登録店区分を指定",null,null,null,null,null,"0:登録店以外\n1:登録店","△:無指定",null,"ｺｰﾄﾞ",null,"○","○","○","ｺｰﾄﾞ","21","登録店区分","X",1,0,null,"66","支払控除その他符号",null,null,"X",1]
[null,null,"68","定番特売区分",null,null,"X",1,null,null,"定番発注/特売発注の区分",null,null,null,null,null,"0:定番\n1:特売\n","△:分類不能",null,"ｺｰﾄﾞ",null,"○","属性初期値","◎",null,null,{"$f":"IF($Z80=\"\",\"\",VLOOKUP($Z80,$AF$6:$AM$89,2,))","v":""},"","","",null,"67","支払控除その他",null,null,9,11]
[null,"2.1","69","消費税区分",null,null,"X",1,null,"○","税区分",null,null,null,null,null,"1:外税\n2:内税\n","3:非課税\n△:個別判断",null,"ｺｰﾄﾞ",null,"○","属性初期値","◎",null,null,"","","","",null,"68","支払消費税符号",null,null,"X",1]
[null,"2.1","70","消費税率",null,null,9,2,1,"○","消費税の税率(99.9％)、ゼロ:個別判断　",null,null,"(小数点以下1桁)",null,null,null,null,"属性＋桁数","属性",null,"○","属性初期値","◎",null,null,"","","","",null,"69","支払消費税",null,null,9,10]
[null,null,"71","ロット不足運賃負担区分",null,null,"X",1,null,null,null,null,"(未使用)",null,null,null,null,null,null,null,null,"○","属性初期値","◎",null,null,"","","","",null,"70","支払金額合計符号",null,null,"X",1]
[null,null,"72","取引先区分（一次店）",null,null,"X",1,null,null,"該当項目の取引先の属性区分",null,null,null,null,null,"△:統一取引先(8桁)",null,null,"ｺｰﾄﾞ",null,"○","属性初期値","◎",null,null,"","","","",null,"71","支払金額合計",null,null,9,11]
[null,null,"73","取引先区分（二次店）",null,null,"X",1,null,null,"　　〃 ",null,null,null,null,null,"△:  統一取引先(8桁)\n6:   GLN(13桁)\n7/8:プライベートコード(卸/ﾒｰｶ)",null,null,"ｺｰﾄﾞ",null,"○","属性初期値","◎",null,null,"","","","",null,"72","振込ID",null,null,"X",20]
[null,null,"74","取引先区分（三次店）",null,null,"X",1,null,null,"　　〃 ",null,null,null,null,null,"　　〃 ",null,null,"ｺｰﾄﾞ",null,"○","属性初期値","◎",null,null,"","","","",null,"73","予備０４",null,null,"X",15]
[null,null,"75","取引先区分（届け先）",null,null,"X",1,null,null,"　　〃 ",null,null,null,null,null,"　　〃 ",null,null,"ｺｰﾄﾞ",null,"○","属性初期値","◎",null,null,"","","","",null,"74","改行コード",null,null,"X","2"]
[null,null,"76","取引先区分（チェーン店）",null,null,"X",1,null,null,"　　〃 ",null,null,null,null,null,"　　〃 ",null,null,"ｺｰﾄﾞ",null,"○","属性初期値","◎",null,null,"","","",""]
[null,null,"77","日本語区分（一次店）",null,null,"X",1,null,null,"該当項目の日本語区分",null,null,null,null,null,"△/0:英数カナ\n1:　　漢字(S-JIS/JIS/JEF/IBM)",null,null,"ｺｰﾄﾞ",null,"○","属性初期値","◎",null,null,"","","",""]
[null,null,"78","日本語区分（二次店）",null,null,"X",1,null,null,"　　〃 ",null,null,null,null,null,"　　〃 ",null,null,"ｺｰﾄﾞ",null,"○","属性初期値","◎",null,null,"","","",""]
[null,null,"79","日本語区分（三次店）",null,null,"X",1,null,null,"　　〃 ",null,null,null,null,null,"　　〃 ",null,null,"ｺｰﾄﾞ",null,"○","属性初期値","◎",null,null,"","","",""]
[null,null,"80","日本語区分（届け先）",null,null,"X",1,null,null,"　　〃 ",null,null,null,null,null,"　　〃 ",null,null,"ｺｰﾄﾞ",null,"○","属性初期値","◎",null,null,"","","",""]
[null,null,"81","日本語区分（チェーン店）",null,null,"X",1,null,null,"　　〃 ",null,null,null,null,null,"　　〃 ",null,null,"ｺｰﾄﾞ",null,"○","属性初期値","◎",null,null,"","","",""]
[null,null,"82","日本語区分（住所）",null,null,"X",1,null,null,"　　〃 ",null,null,null,null,null,"　　〃 ",null,null,"ｺｰﾄﾞ",null,"○","属性初期値","◎",null,null,"","","",""]
[null,null,"83","日本語区分（摘要）",null,null,"X",1,null,null,"　　〃 ",null,null,null,null,null,"　　〃 ",null,null,"ｺｰﾄﾞ",null,"○","属性初期値","◎",null,null,"","","",""]
[null,"2.6\n2.8","84","ヘッダー連携エリア",null,null,"X","20",null,null,"旧フォーマット予備連携データ",null,"(新フォーマット間：相対利用可能エリア)",null,null,null,null,null,null,null,null,"○","○","◎",null,"37","予備０３","X",1,0]
[null,null,null,"明細部　　　　　　　　　　　　　　　　　　　　　　　　　　　　　　　　　　　　　　　　",null,null,null,null,null,null,null,null,null,null,null,null,null,null,null,null,null,null,null,null,null,null,"","","",""]
[null,1.6,"85",null,"明細行NO",null,9,2,null,"◎*1\n","伝票内明細数",null,"(*1 集計明細区分＝明細時：必須＋コード チェック、\n  *2       〃          ＝集計時：属性 チェック  　　　　)",null,null,null,"01～06",null,null," *1 必須＋ｺｰﾄﾞ\n *2    属性   ",null,"○","”01”固定","◎",null,null,"","","",""]
[null,null,"86",null,"専用伝票行NO",null,9,2,null,null,"専用伝票の行№",null,"(00～99)",null,null,null,null,null,null,"属性",null,"○","属性初期値","◎",null,null,"","","",""]
[null,null,"87",null,"商品コード識別区分",null,9,1,null,null,"品番(商品コード)の識別区分",null,null,null,null,null,"0:統一商品コード\n1:ＩＴＦコード (14桁)\n3:JANコード    (標準:13桁)\n4:JANコード    (短縮:8桁)\n6:GTINコード  (14桁)",null,null,"ｺｰﾄﾞ",null,"○","”0”固定","◎",null,null,"","","",""]
[null,null,"88",null,"品番",null,"X",16,null,null,"統一商品ｺｰﾄﾞ､ITFｺｰﾄﾞ､JANｺｰﾄﾞ､GTINｺｰﾄﾞ",null,null,"(左詰め)",null,null,null,null,"属性",null,null,"○","ALL\"9\"固定","◎",null,null,"","","",""]
[null,null,"89",null,"商品名",null,"X/N",40,null,null,"商品名",null,"(英数カナは25文字、漢字は20文字)",null,null,null,null,null,null,null,null,"○","”ﾃﾞﾝﾋﾟﾖｳ ｼﾕｳｹｲ\"固定","◎",null,null,"","","",""]
[null,1.6,"90",null,"包装区分",null,9,1,null,"◎*1\n","数量の発注単位の区分",null,"(*1 集計明細区分＝明細時：必須＋コード チェック、\n  *2       〃          ＝集計時：属性 チェック  　　　　)\n(1:ケース発注時) (2:ボール発注時) (3:バラ発注時)",null,null,null,"1:ケース発注\n2:ボール発注\n","3:バラ発注",null," *1 必須＋ｺｰﾄﾞ\n *2    属性   ",null,"○","”1”固定","◎",null,null,"","","",""]
[null,null,"91",null,"内容","ボール内バラ数",9,4,2,null,"包装区分に準じた設定",null,"(ボール内バラ数","/ボール内バラ数","/ゼロ)",null,null,null,"属性＋桁数","属性",null,"○","属性初期値","◎",null,null,"","","",""]
[null,null,"92",null,null,"ケース内ボール数",9,2,null,null,"包装区分に準じた設定",null,"(ケース内ボール数","/ゼロ","/ゼロ)",null,null,null,"属性＋桁数","属性",null,"○","属性初期値","◎",null,null,"","","",""]
[null,null,"93",null,"数量符号",null,"X",1,null,null,"数量の符号",null,null,null,null,null,"△/＋:正数","－:負数","属性","ｺｰﾄﾞ",null,"○","不正コード値 → \"△\"","◎",null,"31",{"$f":"IF($Z106=\"\",\"\",VLOOKUP($Z106,$AF$6:$AM$89,3,))","v":"請求金額符号"},"X",1,0]
[null,null,"94",null,"数量","ケース数量",9,7,null,null,"包装区分に準じた設定",null,"(ケース数量","/ゼロ","/ゼロ)",null,null,null,"属性＋桁数","属性",null,"○","\"0000001\"固定","◎",null,null,{"$f":"IF($Z107=\"\",\"\",VLOOKUP($Z107,$AF$6:$AM$89,2,))","v":""},"","",""]
[null,null,"95",null,null,"ボール数量",9,7,null,null,"包装区分に準じた設定",null,"(ゼロ","/ボール数量","/ゼロ)",null,null,null,"属性＋桁数","属性",null,"○","属性初期値","◎",null,null,{"$f":"IF($Z108=\"\",\"\",VLOOKUP($Z108,$AF$6:$AM$89,2,))","v":""},"","",""]
[null,null,"96",null,null,"バラ数量",9,7,2,null,"包装区分に準じた設定",null,"(バラ数量","/バラ数量","バラ数量)",null,null,null,"属性＋桁数","属性",null,"○","属性初期値","◎",null,null,{"$f":"IF($Z109=\"\",\"\",VLOOKUP($Z109,$AF$6:$AM$89,2,))","v":""},"","",""]
[null,null,"97",null,"単価","請求単価",9,6,2,null,"請求単価",null,"(卸店入価格(バラ単価))",null,null,null,null,null,"属性＋桁数","属性",null,"○","\"00000100\"固定","◎",null,null,{"$f":"IF($Z110=\"\",\"\",VLOOKUP($Z110,$AF$6:$AM$89,2,))","v":""},"","",""]
[null,null,"98",null,null,"支払単価",9,6,2,null,"支払単価",null,"(卸店入価格(バラ単価))",null,null,null,null,null,"属性＋桁数","属性",null,"○","属性初期値","◎",null,null,{"$f":"IF($Z111=\"\",\"\",VLOOKUP($Z111,$AF$6:$AM$89,2,))","v":""},"","",""]
[null,1.2,"99",null,"請求金額符号",null,"X",1,null,null,"請求金額の符号",null,null,null,null,null,"△/＋:正数","－:負数","属性","ｺｰﾄﾞ",null,"○","不正コード値 → \"△\"",null,null,"31",{"$f":"IF($Z112=\"\",\"\",VLOOKUP($Z112,$AF$6:$AM$89,3,))","v":"請求金額符号"},"X",1,0]
[null,1.2,"100",null,"請求金額",null,9,10,null,null,"請求金額",null,"(卸店入価格換算)",null,null,null,null,null,"属性＋桁数","属性",null,"○","○",null,null,"32","請求金額",9,10,0]
[null,1.2,"101",null,"支払金額符号",null,"X",1,null,null,"支払金額の符号",null,null,null,null,null,"△/＋:正数","－:負数","属性","ｺｰﾄﾞ",null,"○","不正コード値 → \"△\"",null,null,"33","支払金額符号","X",1,0]
[null,1.2,"102",null,"支払金額",null,9,10,null,null,"支払金額",null,"(卸店入価格換算)",null,null,null,null,null,"属性＋桁数","属性",null,"○","○",null,null,"34","支払金額",9,10,0]
[null,null,"（次頁に続く）"]
[]
[null,null,"　"]
[]
[null,null,"（前頁の続き）"]
[null,"変更","項番","　項目",null,null,"属性","整数桁","小数桁","必須","　項目説明",null,null,null,null,null,"　コード",null,"アップロード","V２ → Ｖ１･Ｖ２","Ｖ２→ Ｖ１","Ｖ２ ← Ｖ２","Ｖ２ ← Ｖ１","　　　　　　　Ｖ１フォーマット"]
[null,null,null,null,null,null,null,null,null,null,null,null,null,null,null,null,null,null,"チェック","センタチェック","センタチェック","コンバート","コンバート","比較・  変更点",null,"項番","　　項目","属性","整数","小数"]
[null,null,"103",null,"商品添付区分",null,"X",1,null,null,"添付商品扱いの区分",null,"(相対運用)",null,null,null,"△:売上げ\n1:現物添付","2:見本\n3:景品",null,"ｺｰﾄﾞ(新)",null,"○","属性初期値","◎",null,null,{"$f":"IF($Z123=\"\",\"\",VLOOKUP($Z123,$AF$6:$AM$89,2,))","v":""},{"$f":"IF($Z123=\"\",\"\",VLOOKUP($Z123,$AF$6:$AM$89,5,))","v":""},{"$f":"IF($Z123=\"\",\"\",VLOOKUP($Z123,$AF$6:$AM$89,6,))","v":""},{"$f":"IF($Z123=\"\",\"\",VLOOKUP($Z123,$AF$6:$AM$89,7,))","v":""}]
[null,null,"104",null,"支払区分",null,9,2,null,null,"支払データのデータの発生区分",null,null,null,null,null,"00:今回分支払","01:今回未払分",null,"ｺｰﾄﾞ",null,"○","○","◎",null,"22",{"$f":"IF($Z124=\"\",\"\",VLOOKUP($Z124,$AF$6:$AM$89,3,))","v":"請求支払区分"},9,2,0]
[null,null,"105",null,"入荷単位ケース数",null,9,2,null,null,"荷合せ品の場合の１梱包ケース数量を指定する",null,null,null,null,null,"00～20",null,"属性＋桁数","ｺｰﾄﾞ",null,"○","属性初期値","◎",null,null,"","","",""]
[null,null,"106",null,"単価計算区分",null,"X",1,null,null,"単価×数量の計算方法を指定する",null,"(小数点以下端数の計算処置方法)",null,null,null,"△:切捨て\n1:切上げ","2:四捨五入",null,"ｺｰﾄﾞ",null,"○","属性初期値","◎",null,null,"","","",""]
[null,null,"107",null,"卸発注行番号",null,9,2,null,null,"卸売業での発注伝票行NO",null,"(00～99)",null,null,null,null,null,null,"属性",null,"○","属性初期値","◎",null,null,"","","",""]
[null,"2.0","108",null,"資産譲渡日付区分",null,"X",1,null,null,"資産譲渡日付の形式区分",null,null,null,null,null,"△:年月日形式","1:年月形式",null,"ｺｰﾄﾞ",null,"○","属性初期値","◎",null,null,"","","",""]
[null,"2.6\n2.7","109",null,"資産譲渡日付",null,9,8,null,null,"資産譲渡日付                             (西暦 YYYYMMDD)\n※「資産譲渡日付区分」が『１：年月形式』の場合、「YYYYMM00」を設定",null,null,null,null,null,null,null,"属性＋桁数","日付",null,"○","属性初期値","◎",null,null,"","","",""]
[null,null,"110",null,"入庫許容日付区分",null,"X",1,null,null,null,null,"(未使用)",null,null,null,null,null,null,null,null,"○","属性初期値","◎",null,null,"","","",""]
[null,null,"111",null,"入庫許容日付",null,9,8,null,null,null,null,"(未使用)",null,null,null,null,null,null,null,null,"○","属性初期値","◎",null,null,"","","",""]
[null,null,"112",null,"実入庫製品日付区分",null,"X",1,null,null,null,null,"(未使用)",null,null,null,null,null,null,null,null,"○","属性初期値","◎",null,null,"","","",""]
[null,null,"113",null,"実入庫製品日付",null,9,8,null,null,null,null,"(未使用)",null,null,null,null,null,null,null,null,"○","属性初期値","◎",null,null,"","","",""]
[null,null,"114",null,"製造ロット番号",null,"X",10,null,null,null,null,"(未使用)",null,null,null,null,null,null,null,null,"○","属性初期値","◎",null,null,"","","",""]
[null,null,"115",null,"温度管理区分",null,"X",1,null,null,null,null,"(未使用)",null,null,null,null,null,null,null,null,"○","属性初期値","◎",null,null,"","","",""]
[null,null,"116",null,"製品容器区分",null,9,1,null,null,null,null,"(未使用)",null,null,null,null,null,null,null,null,"○","属性初期値","◎",null,null,"","","",""]
[null,null,"117",null,"外箱GTIN(ITF)コード",null,"X",14,null,null,null,null,"(未使用)",null,null,null,null,null,null,null,null,"○","属性初期値","◎",null,null,"","","",""]
[null,null,"118",null,"摘要",null,"X/N",50,null,null,"任意使用",null,"(英数カナは50文字、漢字は25文字)",null,null,null,null,null,null,null,null,"○","属性初期値","◎",null,null,"","","",""]
[null,null,"119",null,"日本語区分（商品名）",null,"X",1,null,null,"該当項目の日本語区分",null,null,null,null,null,"△/0:英数カナ\n1:　　漢字(S-JIS/JIS/JEF/IBM)",null,null,"ｺｰﾄﾞ",null,"○","属性初期値","◎",null,null,"","","",""]
[null,null,"120",null,"日本語区分（摘要）",null,"X",1,null,null,"　　〃 ",null,null,null,null,null,"　　〃 ",null,null,"ｺｰﾄﾞ",null,"○","属性初期値","◎",null,null,"","","",""]
[null,null,"121",null,"菓子業界商品分類コード",null,"X",6,null,null,"菓子業界の新商品分類コード",null,"(JICFSの機能分類コードとして登録)",null,null,null,null,null,null,null,null,"○","属性初期値","◎",null,null,"","","",""]
[null,null,"122",null,"割戻1","割戻計算区分","X",1,null,null,"割戻計算の小数点以下端数処理の計算区分",null,null,null,null,null,"△:切捨て\n1:切上げ","2:四捨五入",null,"ｺｰﾄﾞ",null,"○","属性初期値","◎",null,null,"","","",""]
[null,null,"123",null,null,"割戻区分","X",1,null,null,"割戻の条件区分",null,"(相対で設定)",null,null,null,null,null,null,null,null,"○","属性初期値","◎",null,null,"","","",""]
[null,null,"124",null,null,"割戻基準","X",1,null,null,"割戻の基準の区分",null,null,null,null,null,"△:割戻率\n1:割戻単価","2:割戻金額",null,"ｺｰﾄﾞ",null,"○","属性初期値","◎",null,null,"","","",""]
[null,null,"125",null,null,"割戻率／単価",9,4,2,null,"割戻率／割戻単価／金額の時はゼロ",null,"(小数点以下2桁)",null,null,null,null,null,"属性＋桁数","属性",null,"○","属性初期値","◎",null,null,"","","",""]
[null,null,"126",null,null,"割戻金額符号","X",1,null,null,"割戻金額の符号",null,null,null,null,null,"△/＋:正数","－:負数",null,"ｺｰﾄﾞ",null,"○","属性初期値","◎",null,null,"","","",""]
[null,null,"127",null,null,"割戻金額",9,9,null,null,"割戻計算結果を金額で指定",null,"(円単位)",null,null,null,null,null,"属性＋桁数","属性",null,"○","属性初期値","◎",null,null,"","","",""]
[null,null,"128",null,null,"割戻コード","X",5,null,null,"割戻の種類を表す",null,null,null,null,null,null,null,null,null,null,"○","属性初期値","◎",null,null,"","","",""]
[null,null,"129",null,"割戻2","割戻計算区分","X",1,null,null,"割戻1に同じ",null,null,null,null,null,"割戻1に同じ",null,null,"ｺｰﾄﾞ",null,"○","属性初期値","◎",null,null,"","","",""]
[null,null,"130",null,null,"割戻区分","X",1,null,null,null,null,null,null,null,null,null,null,null,null,null,"○","属性初期値","◎",null,null,"","","",""]
[null,null,"131",null,null,"割戻基準","X",1,null,null,null,null,null,null,null,null,null,null,null,"ｺｰﾄﾞ",null,"○","属性初期値","◎",null,null,"","","",""]
[null,null,"132",null,null,"割戻率／単価",9,4,2,null,null,null,null,null,null,null,null,null,"属性＋桁数","属性",null,"○","属性初期値","◎",null,null,"","","",""]
[null,null,"133",null,null,"割戻金額符号","X",1,null,null,null,null,null,null,null,null,null,null,null,"ｺｰﾄﾞ",null,"○","属性初期値","◎",null,null,"","","",""]
[null,null,"134",null,null,"割戻金額",9,9,null,null,null,null,null,null,null,null,null,null,"属性＋桁数","属性",null,"○","属性初期値","◎",null,null,"","","",""]
[null,null,"135",null,null,"割戻コード","X",5,null,null,null,null,null,null,null,null,null,null,null,null,null,"○","属性初期値","◎",null,null,"","","",""]
[null,null,"136",null,"割戻3","割戻計算区分","X",1,null,null,"割戻1に同じ",null,null,null,null,null,"割戻1に同じ",null,null,"ｺｰﾄﾞ",null,"○","属性初期値","◎",null,null,"","","",""]
[null,null,"137",null,null,"割戻区分","X",1,null,null,null,null,null,null,null,null,null,null,null,null,null,"○","属性初期値","◎",null,null,"","","",""]
[null,null,"138",null,null,"割戻基準","X",1,null,null,null,null,null,null,null,null,null,null,null,"ｺｰﾄﾞ",null,"○","属性初期値","◎",null,null,"","","",""]
[null,null,"139",null,null,"割戻率／単価",9,4,2,null,null,null,null,null,null,null,null,null,"属性＋桁数","属性",null,"○","属性初期値","◎",null,null,"","","",""]
[null,null,"140",null,null,"割戻金額符号","X",1,null,null,null,null,null,null,null,null,null,null,null,"ｺｰﾄﾞ",null,"○","属性初期値","◎",null,null,"","","",""]
[null,null,"141",null,null,"割戻金額",9,9,null,null,null,null,null,null,null,null,null,null,"属性＋桁数","属性",null,"○","属性初期値","◎",null,null,"","","",""]
[null,null,"142",null,null,"割戻コード","X",5,null,null,null,null,null,null,null,null,null,null,null,null,null,"○","属性初期値","◎",null,null,"","","",""]
[null,null,"143",null,"明細連携エリア",null,"X",10,null,null,"旧フォーマット予備連携データ",null,"(新フォーマット間：相対利用可能エリア)",null,null,null,null,null,null,null,null,"○","属性初期値","◎",null,null,"","","",""]
[null,"2.0","144","レコード件数",null,null,9,6,null,null,"レコードの総件数\n・データ送信側では、自身のフォーマットのレコード件数を設定する。\n・データ受信側では、当項目と実際のレコード件数の整合性チェックには利用しない。※下記【トレーラレコード連携時の留意事項】を参照のこと\n",null,null,null,null,null,null,null,"属性＋桁数","属性",null,"○","○",null,null,"38","レコード件数",9,6,0]
[null,"2.0","145","伝票枚数",null,null,9,6,null,null,"伝票枚数（明細型：明細行NO=01の総数、集計型：ヘッダー/明細レコード件数＝レコード件数と同値）",null,null,null,null,null,null,null,"属性＋桁数","属性",null,"○","○",null,null,"39","伝票枚数",9,6,0]
[null,1.2,"146","前回請求残高符号",null,null,"X",1,null,null,"請求データの 前回請求残高符号",null,null,null,null,null,"△/＋:正数","－:負数","属性","ｺｰﾄﾞ",null,"○","不正コード値 → \"△\"","○","コード","40","前回請求残高符号","X",1,0]
[null,1.2,"147","前回請求残高",null,null,9,11,null,null,"請求データの 前回請求残高",null,"(税込み金額)",null,null,null,null,null,"属性＋桁数","属性",null,"○","○",null,null,"41","前回請求残高",9,11,0]
[null,"2.0","148","今回請求金額符号",null,null,"X",1,null,null,"請求データの 今回請求金額符号",null,null,"※税率別内訳の集計値",null,null,"△/＋:正数","－:負数","属性","ｺｰﾄﾞ",null,"○","不正コード値 → \"△\"","○","コード","42","今回請求金額符号","X",1,0]
[null,"2.0","149","今回請求金額",null,null,9,11,null,null,"請求データの 今回請求金額",null,"(税抜き金額)","※税率別内訳の集計値",null,null,null,null,"属性＋桁数","属性",null,"○","○",null,null,"43","今回請求金額",9,11,0]
[null,"2.0","150","請求基本控除符号",null,null,"X",1,null,null,"請求データの 請求基本控除符号",null,null,"※税率別内訳の集計値",null,null,"△/＋:正数","－:負数","属性","ｺｰﾄﾞ",null,"○","不正コード値 → \"△\"","○","コード","44","請求基本控除符号","X",1,0]
[null,"2.0","151","請求基本控除",null,null,9,11,null,null,"請求データの 請求基本控除",null,null,"※税率別内訳の集計値",null,null,null,null,"属性＋桁数","属性",null,"○","○",null,null,"45","請求基本控除",9,11,0]
[null,"2.0","152","請求品種控除符号",null,null,"X",1,null,null,"請求データの 請求品種控除符号",null,null,"※税率別内訳の集計値",null,null,"△/＋:正数","－:負数","属性","ｺｰﾄﾞ",null,"○","不正コード値 → \"△\"","○","コード","46","請求品種控除符号","X",1,0]
[null,"2.0","153","請求品種控除",null,null,9,11,null,null,"請求データの 請求品種控除",null,null,"※税率別内訳の集計値",null,null,null,null,"属性＋桁数","属性",null,"○","○",null,null,"47","請求品種控除",9,11,0]
[null,"2.0","154","請求機能控除符号",null,null,"X",1,null,null,"請求データの 請求機能控除符号",null,null,"※税率別内訳の集計値",null,null,"△/＋:正数","－:負数","属性","ｺｰﾄﾞ",null,"○","不正コード値 → \"△\"","○","コード","48","請求機能控除符号","X",1,0]
[null,"2.0","155","請求機能控除",null,null,9,11,null,null,"請求データの 請求機能控除",null,null,"※税率別内訳の集計値",null,null,null,null,"属性＋桁数","属性",null,"○","○",null,null,"49","請求機能控除",9,11,0]
[null,"2.0","156","請求控除その他符号",null,null,"X",1,null,null,"請求データの 請求控除その他符号",null,null,"※税率別内訳の集計値",null,null,"△/＋:正数","－:負数","属性","ｺｰﾄﾞ",null,"○","不正コード値 → \"△\"","○","コード","50","請求控除その他符号","X",1,0]
[null,"2.0","157","請求控除その他",null,null,9,11,null,null,"請求データの 請求控除その他",null,null,"※税率別内訳の集計値",null,null,null,null,"属性＋桁数","属性",null,"○","○",null,null,"51","請求控除その他",9,11,0]
[null,"2.0","158","請求消費税符号",null,null,"X",1,null,null,"請求データの 請求消費税符号",null,null,"※税率別内訳の集計値",null,null,"△/＋:正数","－:負数","属性","ｺｰﾄﾞ",null,"○","不正コード値 → \"△\"","○","コード","52","請求消費税符号","X",1,0]
[null,"2.0","159","請求消費税",null,null,9,11,null,null,"請求データの 請求消費税",null,null,"※税率別内訳の集計値",null,null,null,null,"属性＋桁数","属性",null,"○","○","○","桁数","53","請求消費税",9,10,0]
[null,"2.0","160","請求金額合計符号",null,null,"X",1,null,null,"請求データの 請求金額合計符号",null,null,"※税率別内訳の集計値",null,null,"△/＋:正数","－:負数","属性","ｺｰﾄﾞ",null,"○","　　不正コード値 → \"△\"","○","コード","54","請求金額合計符号","X",1,0]
[null,2.2999999999999998,"161","請求金額合計",null,null,9,11,null,null,"請求データの 請求金額合計",null,null,"※147＋税率別内訳の集計値",null,null,null,null,"属性＋桁数","属性",null,"○","○",null,null,"55","請求金額合計",9,11,0]
[null,null,"（次頁に続く）"]
[]
[null,null,"　"]
[null,null,"（前頁の続き）"]
[null,"変更","項番","　項目",null,null,"属性","整数桁","小数桁","必須","　項目説明",null,null,null,null,null,"　コード",null,"アップロード","V２ → Ｖ１･Ｖ２","Ｖ２→ Ｖ１","Ｖ２ ← Ｖ２","Ｖ２ ← Ｖ１","　　　　　　　Ｖ１フォーマット"]
[null,null,null,null,null,null,null,null,null,null,null,null,null,null,null,null,null,null,"チェック","センタチェック","センタチェック","コンバート","コンバート","比較・  変更点",null,"項番","　　項目","属性","整数","小数"]
[null,1.2,"162","前回支払残高符号",null,null,"X",1,null,null,"前回支払残高符号",null,null,null,null,null,"△/＋:正数","－:負数","属性","ｺｰﾄﾞ",null,"○","不正コード値 → \"△\"","○","コード","56",{"$f":"IF($Z188=\"\",\"\",VLOOKUP($Z188,$AF$6:$AM$89,2,))","v":"前回支払残高符号"},{"$f":"IF($Z188=\"\",\"\",VLOOKUP($Z188,$AF$6:$AM$89,5,))","v":"X"},{"$f":"IF($Z188=\"\",\"\",VLOOKUP($Z188,$AF$6:$AM$89,6,))","v":1},{"$f":"IF($Z188=\"\",\"\",VLOOKUP($Z188,$AF$6:$AM$89,7,))","v":0}]
[null,1.2,"163","前回支払残高",null,null,9,11,null,null,"前回支払残高",null,"(税込み金額)",null,null,null,null,null,"属性＋桁数","属性",null,"○","○",null,null,"57","前回支払残高",9,11,0]
[null,"2.0","164","今回支払金額符号",null,null,"X",1,null,null,"今回支払金額符号",null,null,"※税率別内訳の集計値",null,null,"△/＋:正数","－:負数","属性","ｺｰﾄﾞ",null,"○","不正コード値 → \"△\"","○","コード","58","今回支払金額符号","X",1,0]
[null,"2.0","165","今回支払金額",null,null,9,11,null,null,"今回支払金額",null,"(税抜き金額)","※税率別内訳の集計値",null,null,null,null,"属性＋桁数","属性",null,"○","○",null,null,"59","今回支払金額",9,11,0]
[null,"2.0","166","支払基本控除符号",null,null,"X",1,null,null,"支払基本控除符号",null,null,"※税率別内訳の集計値",null,null,"△/＋:正数","－:負数","属性","ｺｰﾄﾞ",null,"○","不正コード値 → \"△\"","○","コード","60","支払基本控除符号","X",1,0]
[null,"2.0","167","支払基本控除",null,null,9,11,null,null,"支払基本控除",null,null,"※税率別内訳の集計値",null,null,null,null,"属性＋桁数","属性",null,"○","○",null,null,"61","支払基本控除",9,11,0]
[null,"2.0","168","支払品種控除符号",null,null,"X",1,null,null,"支払品種控除符号",null,null,"※税率別内訳の集計値",null,null,"△/＋:正数","－:負数","属性","ｺｰﾄﾞ",null,"○","不正コード値 → \"△\"","○","コード","62","支払品種控除符号","X",1,0]
[null,"2.0","169","支払品種控除",null,null,9,11,null,null,"支払品種控除",null,null,"※税率別内訳の集計値",null,null,null,null,"属性＋桁数","属性",null,"○","○",null,null,"63","支払品種控除",9,11,0]
[null,"2.0","170","支払機能控除符号",null,null,"X",1,null,null,"支払機能控除符号",null,null,"※税率別内訳の集計値",null,null,"△/＋:正数","－:負数","属性","ｺｰﾄﾞ",null,"○","不正コード値 → \"△\"","○","コード","64","支払機能控除符号","X",1,0]
[null,"2.0","171","支払機能控除",null,null,9,11,null,null,"支払機能控除",null,null,"※税率別内訳の集計値",null,null,null,null,"属性＋桁数","属性",null,"○","○",null,null,"65","支払機能控除",9,11,0]
[null,"2.0","172","支払控除その他符号",null,null,"X",1,null,null,"支払控除その他符号",null,null,"※税率別内訳の集計値",null,null,"△/＋:正数","－:負数","属性","ｺｰﾄﾞ",null,"○","不正コード値 → \"△\"","○","コード","66","支払控除その他符号","X",1,0]
[null,"2.0","173","支払控除その他",null,null,9,11,null,null,"支払控除その他",null,null,"※税率別内訳の集計値",null,null,null,null,"属性＋桁数","属性",null,"○","○",null,null,"67","支払控除その他",9,11,0]
[null,"2.0","174","支払消費税符号",null,null,"X",1,null,null,"支払消費税符号",null,null,"※税率別内訳の集計値",null,null,"△/＋:正数","－:負数","属性","ｺｰﾄﾞ",null,"○","不正コード値 → \"△\"","○","コード","68","支払消費税符号","X",1,0]
[null,"2.0","175","支払消費税",null,null,9,11,null,null,"支払消費税",null,null,"※税率別内訳の集計値",null,null,null,null,"属性＋桁数","属性",null,"○","○","○","桁数","69","支払消費税",9,10,0]
[null,"2.0","176","支払金額合計符号",null,null,"X",1,null,null,"支払金額合計符号",null,null,"※税率別内訳の集計値",null,null,"△/＋:正数","－:負数","属性","ｺｰﾄﾞ",null,"○","　　不正コード値 → \"△\"","○","コード","70","支払金額合計符号","X",1,0]
[null,2.2999999999999998,"177","支払金額合計",null,null,9,11,null,null,"支払金額合計",null,null,"※163＋税率別内訳の集計値",null,null,null,null,"属性＋桁数","属性",null,"○","○",null,null,"71","支払金額合計",9,11,0]
[null,1.2,"178","振込ID",null,null,"X",20,null,null,"当面スペース",null,null,null,null,null,null,null,null,null,null,"○","○",null,null,"72","振込ID","X",20,0]
[null,1.2,"179","連携エリア",null,null,"X",20,null,null,"レイアウト拡張用の予備領域",null,"(利用禁止)",null,null,null,null,null,null,null,null,"○","属性初期値","◎",null,null,"","","",""]
[null,1.1000000000000001,"180","支払元カナ名",null,null,"X",30,null,null,"支払元(卸)","のカナ名称","(支払元名 に漢字を設定する場合、必須)",null,null,null,null,null,null,null,null,"○","属性初期値","◎",null,null,"","","",""]
[null,1.1000000000000001,"181","支払先カナ名",null,null,"X",30,null,null,"支払先(メーカ)","のカナ名称","(支払先名 に漢字を設定する場合、必須)",null,null,null,null,null,null,null,null,"○","属性初期値","◎",null,null,"","","",""]
[null,1.1000000000000001,"182","一次店カナ名",null,null,"X",30,null,null,"一次店カナ名",null,"(一次店名 に漢字を設定する場合、必須)",null,null,null,null,null,null,null,null,"○","属性初期値","◎",null,null,"","","",""]
[null,1.1000000000000001,"183","二次店カナ名",null,null,"X",30,null,null,"二次店カナ名",null,"(二次店名 に漢字を設定する場合、必須)",null,null,null,null,null,null,null,null,"○","属性初期値","◎",null,null,"","","",""]
[null,1.1000000000000001,"184","届け先カナ名",null,null,"X",30,null,null,"届け先カナ名",null,"(届け先名  に漢字を設定する場合、必須)",null,null,null,null,null,null,null,null,"○","属性初期値","◎",null,null,"","","",""]
[null,1.1000000000000001,"185","摘要カナ",null,null,"X",30,null,null,"摘要カナ",null,"(摘要        に漢字を設定する場合、必須)",null,null,null,null,null,null,null,null,"○","属性初期値","◎",null,null,"","","",""]
[null,1.1000000000000001,"186","商品名カナ",null,null,"X",25,null,null,"商品名カナ",null,"(商品名     に漢字を設定する場合、必須)",null,null,null,null,null,null,null,null,"○","属性初期値","◎",null,null,"","","",""]
[null,"2.0","187","支払確認期限区分",null,null,"X",1,null,null,"支払確認期限の区分",null,null,null,null,null,"△:日付指定   ","１:日数指定",null,"コード",null,"○","属性初期値","◎"]
[null,"2.0","188","支払確認期限日付",null,null,"9",8,null,null,"支払確認期限日付（YYYYMMDD）",null,null,null,null,null,null,null,"属性＋桁数","日付",null,"○","属性初期値","◎"]
[null,"2.0","189","支払確認期限日数",null,null,"9",2,null,null,"支払確認期限日数",null,null,null,null,null,null,null,"属性","属性",null,"○","属性初期値","◎"]
[null,"2.0","190","登録番号",null,null,"X",14,null,null,"”T”＋法人番号13桁",null,"※2021.10以降、税務署への申告により取得のうえ設定",null,null,null,null,null,null,null,null,"○","属性初期値"]
[null,2.2999999999999998,null,{"$f":"\"税率別内訳１ ※未使用ブロックは全て空値(,,囲み)を設定する。\"","v":"税率別内訳１ ※未使用ブロックは全て空値(,,囲み)を設定する。"},null,null,null,null,null,null,"繰返部の設定順序は、軽減税率8%、標準税率10%、予備税率（卸提供の役務10%）"]
[null,"2.1\n2.0","191",null,"消費税率",null,9,2,1,null,"消費税の税率(99.9％)、ゼロ:個別判断　",null,null,"(小数点以下1桁)",null,null,null,null,"属性＋桁数","属性",null,"○","ALL SPACE","◎"]
[null,"2.1\n2.0","192",null,"今回請求金額符号",null,"X",1,null,null,"今回請求金額符号",null,null,null,null,null,"△/＋:正数","－:負数","属性","ｺｰﾄﾞ",null,"○",null,"◎"]
[null,"2.1\n2.0","193",null,"今回請求金額",null,9,11,null,null,"今回請求金額",null,"(税抜き金額)",null,null,null,null,null,"属性＋桁数","属性",null,"○",null,"◎"]
[null,"2.1\n2.0","194",null,"請求基本控除符号",null,"X",1,null,null,"請求基本控除符号",null,null,null,null,null,"△/＋:正数","－:負数","属性","ｺｰﾄﾞ",null,"○",null,"◎"]
[null,"2.1\n2.0","195",null,"請求基本控除",null,9,11,null,null,"請求基本控除",null,null,null,null,null,null,null,"属性＋桁数","属性",null,"○",null,"◎"]
[null,"2.1\n2.0","196",null,"請求品種控除符号",null,"X",1,null,null,"請求品種控除符号",null,null,null,null,null,"△/＋:正数","－:負数","属性","ｺｰﾄﾞ",null,"○",null,"◎"]
[null,"2.1\n2.0","197",null,"請求品種控除",null,9,11,null,null,"請求品種控除",null,null,null,null,null,null,null,"属性＋桁数","属性",null,"○",null,"◎"]
[null,"2.1\n2.0","198",null,"請求機能控除符号",null,"X",1,null,null,"請求機能控除符号",null,null,null,null,null,"△/＋:正数","－:負数","属性","ｺｰﾄﾞ",null,"○",null,"◎"]
[null,"2.1\n2.0","199",null,"請求機能控除",null,9,11,null,null,"請求機能控除",null,null,null,null,null,null,null,"属性＋桁数","属性",null,"○",null,"◎"]
[null,"2.1\n2.0","200",null,"請求控除その他符号",null,"X",1,null,null,"請求控除その他符号",null,null,null,null,null,"△/＋:正数","－:負数","属性","ｺｰﾄﾞ",null,"○",null,"◎"]
[null,"2.1\n2.0","201",null,"請求控除その他",null,9,11,null,null,"請求控除その他",null,null,null,null,null,null,null,"属性＋桁数","属性",null,"○",null,"◎"]
[null,"2.1\n2.0","202",null,"請求消費税符号",null,"X",1,null,null,"請求消費税符号",null,null,null,null,null,"△/＋:正数","－:負数","属性","ｺｰﾄﾞ",null,"○",null,"◎"]
[null,"2.1\n2.0","203",null,"請求消費税",null,9,11,null,null,"請求消費税",null,"(193 – 195 – 197 – 199 – 201) × 191",null,null,null,null,null,"属性＋桁数","属性",null,"○",null,"◎"]
[null,"2.1\n2.0","204",null,"税込請求金額符号",null,"X",1,null,null,"税込請求金額符号",null,null,null,null,null,"△/＋:正数","－:負数","属性","ｺｰﾄﾞ",null,"○",null,"◎"]
[null,"2.1\n2.0","205",null,"税込請求金額",null,9,11,null,null,"税込請求金額",null,"(193 – 195 – 197 – 199 – 201  ＋ 203)",null,null,null,null,null,"属性＋桁数","属性",null,"○",null,"◎"]
[null,"2.1\n2.0","206",null,"今回支払金額符号",null,"X",1,null,null,"今回支払金額符号",null,null,null,null,null,"△/＋:正数","－:負数","属性","ｺｰﾄﾞ",null,"○",null,"◎"]
[null,"2.1\n2.0","207",null,"今回支払金額",null,9,11,null,null,"今回支払金額",null,"(税抜き金額)",null,null,null,null,null,"属性＋桁数","属性",null,"○",null,"◎"]
[null,"2.1\n2.0","208",null,"支払基本控除符号",null,"X",1,null,null,"支払基本控除符号",null,null,null,null,null,"△/＋:正数","－:負数","属性","ｺｰﾄﾞ",null,"○",null,"◎"]
[null,"2.1\n2.0","209",null,"支払基本控除",null,9,11,null,null,"支払基本控除",null,null,null,null,null,null,null,"属性＋桁数","属性",null,"○",null,"◎"]
[null,"2.1\n2.0","210",null,"支払品種控除符号",null,"X",1,null,null,"支払品種控除符号",null,null,null,null,null,"△/＋:正数","－:負数","属性","ｺｰﾄﾞ",null,"○",null,"◎"]
[null,"2.1\n2.0","211",null,"支払品種控除",null,9,11,null,null,"支払品種控除",null,null,null,null,null,null,null,"属性＋桁数","属性",null,"○",null,"◎"]
[null,"2.1\n2.0","212",null,"支払機能控除符号",null,"X",1,null,null,"支払機能控除符号",null,null,null,null,null,"△/＋:正数","－:負数","属性","ｺｰﾄﾞ",null,"○",null,"◎"]
[null,"2.1\n2.0","213",null,"支払機能控除",null,9,11,null,null,"支払機能控除",null,null,null,null,null,null,null,"属性＋桁数","属性",null,"○",null,"◎"]
[null,"2.1\n2.0","214",null,"支払控除その他符号",null,"X",1,null,null,"支払控除その他符号",null,null,null,null,null,"△/＋:正数","－:負数","属性","ｺｰﾄﾞ",null,"○",null,"◎"]
[null,"2.1\n2.0","215",null,"支払控除その他",null,9,11,null,null,"支払控除その他",null,null,null,null,null,null,null,"属性＋桁数","属性",null,"○",null,"◎"]
[null,"2.1\n2.0","216",null,"支払消費税符号",null,"X",1,null,null,"支払消費税符号",null,null,null,null,null,"△/＋:正数","－:負数","属性","ｺｰﾄﾞ",null,"○",null,"◎"]
[null,"2.1\n2.0","217",null,"支払消費税",null,9,11,null,null,"支払消費税",null,"(207 – 209 – 211 – 213 – 215) × 191",null,null,null,null,null,"属性＋桁数","属性",null,"○",null,"◎"]
[null,"2.1\n2.0","218",null,"税込支払金額符号",null,"X",1,null,null,"税込支払金額符号",null,null,null,null,null,"△/＋:正数","－:負数","属性","ｺｰﾄﾞ",null,"○",null,"◎"]
[null,"2.1\n2.0","219",null,"税込支払金額",null,9,11,null,null,"税込支払金額",null,"(207 – 209 – 211 – 213 – 215  ＋ 217)",null,null,null,null,null,"属性＋桁数","属性",null,"○",null,"◎"]
[null,2.2999999999999998,null,{"$f":"\"税率別内訳２ ※未使用ブロックは全て空値(,,囲み)を設定する。\"","v":"税率別内訳２ ※未使用ブロックは全て空値(,,囲み)を設定する。"}]
[null,"2.1\n2.0",{"$f":"191+29 & \"～\"","v":"220～"}," ","※税別内訳１に同じ",null,null,null,null,null,null,null,null,null,null,null,null,null,null,null,null,null,"ALL SPACE"]
[null,"2.1\n2.0",{"$f":"219+29","v":248}]
[null,2.2999999999999998,null,{"$f":"\"税率別内訳３ ※未使用ブロックは全て空値(,,囲み)を設定する。\"","v":"税率別内訳３ ※未使用ブロックは全て空値(,,囲み)を設定する。"}]
[null,"2.1\n2.0",{"$f":"191+58 & \"～\"","v":"249～"}," ","※税別内訳１に同じ",null,null,null,null,null,null,null,null,null,null,null,null,null,null,null,null,null,"ALL SPACE"]
[null,"2.1\n2.0",{"$f":"219+58","v":277}]
[null,2.6,"278","登録番号2",null,null,"X","14",null,null,"”T”＋法人番号13桁",null,null,null,null,null,null,null,null,null,null,"○","属性初期値",null,null,null,{"$f":"IF($Z253=\"\",\"\",VLOOKUP($Z253,$AF$6:$AM$71,2,))","v":""},{"$f":"IF($Z253=\"\",\"\",VLOOKUP($Z253,$AF$6:$AM$71,5,))","v":""},{"$f":"IF($Z253=\"\",\"\",VLOOKUP($Z253,$AF$6:$AM$71,6,))","v":""},{"$f":"IF($Z253=\"\",\"\",VLOOKUP($Z253,$AF$6:$AM$71,7,))","v":""}]
[null,2.8,"279","請求番号",null,null,"X","10",null,null,"請求番号",null,null,null,null,null,null,null,null,null,null,"○","属性初期値","◎",null,null,{"$f":"IF($Z254=\"\",\"\",VLOOKUP($Z254,$AF$6:$AM$89,2,))","v":""},{"$f":"IF($Z254=\"\",\"\",VLOOKUP($Z254,$AF$6:$AM$89,5,))","v":""},{"$f":"IF($Z254=\"\",\"\",VLOOKUP($Z254,$AF$6:$AM$89,6,))","v":""},{"$f":"IF($Z254=\"\",\"\",VLOOKUP($Z254,$AF$6:$AM$89,7,))","v":""}]
[null,null,"280","改行コード",null,null,"X","2",null,null,"S-JISの改行コードを設定",null,null,null,null,null,null,null,null,null,null,null,null,null,null,null,"","","",""]
[]
[null,null,null,null,null,null,null,null,null,null," ※ファイルの形式は、カンマ区切りの可変長形式となります。各項目の値にダブルクォート「\"」の囲みは不要です。"]
[null,null,null,null,null,null,null,null,null,null," ※画面から受信（ダウンロード）したファイルの最終行にはエンドレコードが出力されます。"]
[null,null,null,null,null,null,null,null,null,null,"　  エンドレコードのレイアウトは「エンドレコード」を参照してください。"]
[null,null,null,null,null,null,null,null,null,null," ※画面から送信（アップロード）するファイルにエンドレコードは不要です。"]

{"sheet":"４３販売報告","index":15,"n_rows":86,"n_cols":39,"rows_kept":86,"cut":false,"hidden":false,"merged":[[59,1,60,1],[59,2,60,2],[59,3,60,4],[59,6,60,6],[59,7,60,7],[3,32,4,33],[59,9,60,9],[59,10,60,10],[59,23,59,27],[60,23,60,24],[3,16,4,16],[70,10,70,15],[33,16,33,17],[37,16,37,17],[45,16,45,17],[68,16,68,17],[59,16,60,16],[59,8,60,8],[3,37,4,37],[3,38,4,38],[3,1,4,1],[3,2,4,2],[3,7,4,7],[3,3,4,4],[3,6,4,6],[3,10,4,10],[3,9,4,9],[3,8,4,8],[3,31,4,31],[3,23,3,27],[4,23,4,24],[3,35,4,35],[3,36,4,36]]}
[null,null,null,null,null,null,null,null,null,null,null,null,null,null,null,null,null,null,null,null,null,null,null,null,null,null,null,null,null,null,null,null,{"$f":"シート別総ページ数","v":{"$error":"#NAME?"}}]
[null,null,"（８） Ｖ２・４３販売報告",null,null,null,null,null,null,null,null,null,null,null,null,null,null,null,null,null,null,null,null,null,null,null,null,null,null,null,null,"（６） Ｖ１・４２販売報告"]
[null,null,"　",null,null,null,null,null,null,null,null,null,null,null,null,null,null,null,null,null,null,null,null,null,null,null,null,null,null,null,null,"　"]
[null,"変更","項番","　項目",null,null,"属性","整数桁","小数桁","必須","　項目説明",null,null,null,null,null,"　コード",null,"アップロード","V２ → Ｖ１･Ｖ２","Ｖ２→ Ｖ１","Ｖ２ ← Ｖ２","Ｖ２ ← Ｖ１","　　　　　　　Ｖ１フォーマット",null,null,null,null,null,null,null,"項番","　項目",null,null,"属性","整数桁","小数桁","必須"]
[null,null,null,null,null,null,null,null,null,null,null,null,null,null,null,null,null,null,"チェック","センタチェック","センタチェック","コンバート","コンバート","比較・  変更点",null,"項番","　　項目","属性","整数","小数"]
[null,null,"1","データ種別",null,null,9,2,null,"◎","４３：販売報告データ",null,null,null,null,null,43,null,"必須","ｺｰﾄﾞ",null,"○","\"43\"固定","○","ｺｰﾄﾞ",null,{"$f":"IF($Z6=\"\",\"\",VLOOKUP($Z6,$AF$6:$AM$17,2,))","v":""},{"$f":"IF($Z6=\"\",\"\",VLOOKUP($Z6,$AF$6:$AM$17,6,))","v":""},{"$f":"IF($Z6=\"\",\"\",VLOOKUP($Z6,$AF$6:$AM$17,7,))","v":""},{"$f":"IF($Z6=\"\",\"\",VLOOKUP($Z6,$AF$6:$AM$17,8,))","v":""},null,"1","データ種別",null,null,"9",2,null,"◎"]
[null,null,"2","最終トレーラ判定区分",null,null,"X",1,null,"◎","トレーラ判定の区分",null,null,null,null,null,"9:最終","△:それ以外",null,"ｺｰﾄﾞ",null,"○","○",null,null,"2",{"$f":"IF($Z7=\"\",\"\",VLOOKUP($Z7,$AF$6:$AM$45,2,))","v":"最終トレーラ判定区分"},{"$f":"IF($Z7=\"\",\"\",VLOOKUP($Z7,$AF$6:$AM$45,5,))","v":"X"},{"$f":"IF($Z7=\"\",\"\",VLOOKUP($Z7,$AF$6:$AM$45,6,))","v":1},{"$f":"IF($Z7=\"\",\"\",VLOOKUP($Z7,$AF$6:$AM$45,7,))","v":0},null,"2","最終トレーラ判定区分",null,null,"X",1,null,"◎"]
[null,null,"3","送信先コード",null,null,9,8,null,"◎","送信先(メーカ)","の統一取引先コード",null,null,null,null,null,null,"必須＋属性＋桁数＋登録","センター登録",null,"○","○",null,null,"3","送信先コード",{"$f":"IF($Z8=\"\",\"\",VLOOKUP($Z8,$AF$6:$AM$45,5,))","v":"9"},{"$f":"IF($Z8=\"\",\"\",VLOOKUP($Z8,$AF$6:$AM$45,6,))","v":8},{"$f":"IF($Z8=\"\",\"\",VLOOKUP($Z8,$AF$6:$AM$45,7,))","v":0},null,"3","送信先コード",null,null,"9",8,null,"◎"]
[null,null,"4","送信元コード",null,null,9,8,null,"◎","送信元(卸)     ","の統一取引先コード",null,null,null,null,null,null,"必須＋属性＋桁数＋登録","センター登録",null,"○","○",null,null,"4","送信元コード",{"$f":"IF($Z9=\"\",\"\",VLOOKUP($Z9,$AF$6:$AM$45,5,))","v":"9"},{"$f":"IF($Z9=\"\",\"\",VLOOKUP($Z9,$AF$6:$AM$45,6,))","v":8},{"$f":"IF($Z9=\"\",\"\",VLOOKUP($Z9,$AF$6:$AM$45,7,))","v":0},null,"4","送信元コード",null,null,"9",8,null,"◎"]
[null,null,"5","データ作成日",null,null,9,8,null,"◎","データ作成日付",null,"(西暦 YYYYMMDD)",null,null,null,null,null,null,"必須＋日付","センタチェック","○","○",null,null,"5","データ作成日","9",8,0,null,"5","データ作成日",null,null,"9",8,null,"○"]
[null,null,"6","データ作成時刻",null,null,9,6,null,null,"データ作成時刻",null,"(HHMMSS)",null,null,null,null,null,null,"時刻","と同じ","○","属性初期値","◎",null,null,"","","","",null,"6","送信先名",null,null,"X",20,null,"○"]
[null,null,"7","送信先名",null,null,"X",20,null,"○","送信先(メーカ)名          ",null,"(英数カナのみ)",null,null,null,null,null,"属性",null,null,"○","○",null,null,"6","送信先名","X",20,0,null,"7","送信元名",null,null,"X",20,null,"○"]
[null,null,"8","送信元名",null,null,"X",20,null,"◎","送信元(卸)名 　          　",null,"(英数カナのみ)",null,null,null,null,null,"属性","必須",null,"○","○",null,null,"7","送信元名","X",20,0,null,"8","直接送信先コード",null,null,"9",8]
[null,null,"9","直接送信先コード",null,null,9,8,null,null,"送信先コードと異なる場合にセット          ",null,"(通常はゼロ)",null,null,null,null,null,null,"センター登録",null,"○","○",null,null,"8","直接送信先コード","9",8,0,null,"9","直接送信先カナ名",null,null,"X",20]
[null,null,"10","直接送信先カナ名",null,null,"X",20,null,null,"直接送信先名",null,"(英数カナのみ、通常はスペース)",null,null,null,null,null,"属性",null,null,"○","○",null,null,"9","直接送信先カナ名","X",20,0,null,"10","予備０１",null,null,"X",161]
[null,null,"11","送信ファイルNO",null,null,9,2,null,null,"同時送信時の問合せ№",null,"(00～99)",null,null,null,null,null,null,"属性",null,"○","属性初期値","◎",null,null,"","","","",null,"11","対象期日(自)",null,null,"9",8,null,"○"]
[null,null,"12","連携エリア",null,null,"X",20,null,null,"新フォーマット間：相対利用可能エリア",null,null,null,null,null,null,null,null,null,null,"○","属性初期値","◎",null,null,"","","","",null,"12","対象期日(至) ",null,null,"9",8,null,"○"]
[null,null,"13","対象期日（自）",null,null,9,8,null,"◎","販売実績の該当年月日（開始日）",null,"(西暦 YYYYMMDD)",null,null,null,null,null,"必須＋属性＋桁数","必須+日付",null,"○","○",null,null,"11","対象期日(自)","9",8,0,null,"13","取引コード",null,null,"9",2,null,"○"]
[null,null,"14","対象期日（至）",null,null,9,8,null,"○","販売実績の該当年月日（終了日）",null,"(西暦 YYYYMMDD)",null,null,null,null,null,"属性＋桁数","日付",null,"○","○",null,null,"12","対象期日(至) ","9",8,0,null,"14","一次店コード",null,null,"9",8,null,"○"]
[null,2.7,"15","取引コード",null,null,9,2,null,"○","業界統一取引コード",null,null,null,null,null,"11:店入売上\n12:店入売上訂正\n21:店入返品\n22:店入返品訂正\n31:直送売上\n32:直送売上訂正\n\n\n\n","41:直送返品\n42:直送返品訂正\n51:割戻し金\n52:相殺\n81:ﾒｰｶｰ提供の役務\n91:卸提供の役務","属性＋桁数","ｺｰﾄﾞ",null,"○","○",null,null,"13","取引コード","9",2,0,null,"15","二次店コード",null,null,"9",8]
[null,null,"16","一次店コード",null,null,"X",13,null,"○","統一取引先コード(8桁)",null,null,null,"(後方スペース埋め)",null,null,null,"必須＋桁数",null,null,"○","○","○","属性＋桁数","14","一次店コード","9",8,0,null,"16","届け先コード",null,null,"9",8,null,"○"]
[null,null,"17","二次店コード",null,null,"X",13,null,null,"統一取引先コード(8桁)／プライベート・コード(3～8桁)／ＧＬＮ(13桁)",null,null,null,"(後方スペース埋め)",null,null,null,"桁数",null,null,"○","○","○","属性＋桁数","15","二次店コード","9",8,0,null,"17","一次店カナ名",null,null,"X",30,null,"○"]
[null,null,"18","三次店コード",null,null,"X",13,null,null,"統一取引先コード(8桁)／プライベート・コード(3～8桁)／ＧＬＮ(13桁)",null,null,null,"(後方スペース埋め)",null,null,null,"桁数",null,null,"○","属性初期値","◎",null,null,"","","","",null,"18","二次店カナ名",null,null,"X",30]
[null,null,"19","届け先コード",null,null,"X",13,null,"○","統一取引先コード(8桁)／プライベート・コード(3～8桁)／ＧＬＮ(13桁)",null,null,null,"(後方スペース埋め)",null,null,null,"桁数",null,null,"○","○","○","属性＋桁数","16","届け先コード","9",8,0,null,"19","届け先カナ名",null,null,"X",30,null,"○"]
[null,null,"20","チェーン店コード",null,null,"X",13,null,null,"統一取引先コード(8桁)／プライベート・コード(3～8桁)／ＧＬＮ(13桁)",null,null,null,"(後方スペース埋め)",null,null,null,"桁数",null,null,"○","属性初期値","◎",null,null,"","","","",null,"20","税区分",null,null,"X",1]
[null,null,"21","一次店名",null,null,"X/N",40,null,null,"一次店名",null,"(英数カナは30文字、漢字は20文字)",null,null,null,null,null,null,null,null,"○","○","○","属性＋桁数","17","一次店カナ名","X",30,0,null,"21","税率",null,null,"9",2,1]
[null,null,"22","二次店名",null,null,"X/N",40,null,null,"二次店名",null,"(英数カナは30文字、漢字は20文字)",null,null,null,null,null,null,null,null,"○","○","○","属性＋桁数","18","二次店カナ名","X",30,0,null,"22","予備０２",null,null,"X",101]
[null,null,"23","三次店名",null,null,"X/N",40,null,null,"三次店名",null,"(英数カナは30文字、漢字は20文字)",null,null,null,null,null,null,null,null,"○","属性初期値","◎",null,null,"","","","",null,null,"明細部　　　　　　　　　　　　　　　　　　　　　　　　　　　　　　　　　　　　　　　　"]
[null,null,"24","届け先名",null,null,"X/N",40,null,null,"届け先名",null,"(英数カナは30文字、漢字は20文字)",null,null,null,null,null,null,null,null,"○","○","○","属性＋桁数","19","届け先カナ名","X",30,0,null,"23",null,"商品コード識別区分",null,"X",1,null,"○"]
[null,null,"25","チェーン店名",null,null,"X/N",40,null,null,"チェーン店名",null,"(英数カナは30文字、漢字は20文字)",null,null,null,null,null,null,null,null,"○","属性初期値","◎",null,null,"","","","",null,"24",null,"品番",null,"X",16,null,"○"]
[null,null,"26","消費税区分",null,null,"X",1,null,null,"税区分",null,null,null,null,null,"1:外税\n2:内税\n","3:非課税\n△:個別判断","属性＋桁数","ｺｰﾄﾞ",null,"○","\"1\"･\"2\"･\"△\"以外\n→ \"△\"","○","名称＋ｺｰﾄﾞ","20","税区分","X",1,0,null,"25",null,"バラ総数符号",null,"X",1,null,"○"]
[null,null,"27","消費税率",null,null,9,2,1,null,"消費税の税率(99.9％)、ゼロ:個別判断　",null,null,"(小数点以下1桁)",null,null,null,null,"属性＋桁数","属性",null,"○","　　税区分が\n　　\"1\"･\"2\"･\"△\"以外\n　　　→ 属性初期化","○","名称","21","税率","9",2,1,null,"26",null,"バラ総数",null,"9",9,null,"○"]
[null,null,"28","取引先区分（一次店）",null,null,"X",1,null,null,"該当項目の取引先の属性区分",null,null,null,null,null,"△:統一取引先(8桁)",null,null,"ｺｰﾄﾞ",null,"○","属性初期値","◎",null,null,"","","","",null,"27",null,"単価",null,"9",6,2,"○"]
[null,1.3,"29","取引先区分（二次店）",null,null,"X",1,null,null,"　　〃 ",null,null,null,null,null,"△:  統一取引先(8桁)\n6:   GLN(13桁)\n7/8:プライベートコード(卸/ﾒｰｶ)",null,null,"ｺｰﾄﾞ",null,"○","属性初期値","◎",null,null,"","","","",null,"28",null,"金額符号",null,"X",1,null,"○"]
[null,null,"30","取引先区分（三次店）",null,null,"X",1,null,null,"　　〃 ",null,null,null,null,null,"　　〃 ",null,null,"ｺｰﾄﾞ",null,"○","属性初期値","◎",null,null,"","","","",null,"29",null,"金額",null,"9",10,null,"○"]
[null,1.3,"31","取引先区分（届け先）",null,null,"X",1,null,null,"　　〃 ",null,null,null,null,null,"　　〃 ",null,null,"ｺｰﾄﾞ",null,"○","属性初期値","◎",null,null,"","","","",null,"30",null,"予備０３",null,"X",1]
[null,null,"32","取引先区分（チェーン店）",null,null,"X",1,null,null,"　　〃 ",null,null,null,null,null,"　　〃 ",null,null,"ｺｰﾄﾞ",null,"○","属性初期値","◎",null,null,"","","","",null,"31","予備０４",null,null,"X",2]
[null,null,"33","日本語区分（一次店）",null,null,"X",1,null,null,"該当項目の日本語区分",null,null,null,null,null,"△/0:英数カナ\n1:　　漢字(S-JIS/JIS/JEF/IBM)",null,null,"ｺｰﾄﾞ",null,"○","属性初期値","◎",null,null,"","","","",null,"32","レコード件数",null,null,"9",6,null,"○"]
[null,null,"34","日本語区分（二次店）",null,null,"X",1,null,null,"　　〃 ",null,null,null,null,null,"　　〃 ",null,null,"ｺｰﾄﾞ",null,"○","属性初期値","◎",null,null,"","","","",null,"33","明細件数",null,null,"9",6]
[null,null,"35","日本語区分（三次店）",null,null,"X",1,null,null,"　　〃 ",null,null,null,null,null,"　　〃 ",null,null,"ｺｰﾄﾞ",null,"○","属性初期値","◎",null,null,"","","","",null,"34","合計金額符号",null,null,"X",1]
[null,null,"36","日本語区分（届け先）",null,null,"X",1,null,null,"　　〃 ",null,null,null,null,null,"　　〃 ",null,null,"ｺｰﾄﾞ",null,"○","属性初期値","◎",null,null,"","","","",null,"35","合計金額",null,null,"9",10]
[null,null,"37","日本語区分（チェーン店）",null,null,"X",1,null,null,"　　〃 ",null,null,null,null,null,"　　〃 ",null,null,"ｺｰﾄﾞ",null,"○","属性初期値","◎",null,null,"","","","",null,"36","予備０５",null,null,"X",214]
[null,null,"38","ヘッダー連携エリア",null,null,"X",20,null,null,"旧フォーマット予備連携データ",null,"(新フォーマット間：相対利用可能エリア)",null,null,null,null,null,null,null,null,"○","○","◎",null,"22","予備０２","X",101,0,null,"37","改行コード",null,null,"X","2"]
[null,null,null,"明細部　　　　　　　　　　　　　　　　　　　　　　　　　　　　　　　　　　　　　　　　",null,null,null,null,null,null,null,null,null,null,null,null,null,null,null,null,null,null,null,null,null,null,"","","",""]
[null,null,"39",null,"明細行NO",null,9,3,null,"◎","ヘッダ内明細行数",null,"(001～999)",null,null,null,null,null,null,"必須＋属性",null,"○","属性初期値","◎",null,null,"","","",""]
[null,null,"40",null,"商品コード識別区分",null,9,1,null,"○","品番(商品コード)の識別区分",null,null,null,null,null,"0:統一商品コード\n1:ＩＴＦコード (14桁)\n2:ＩＴＦコード(16桁)  【利用停止化】\n3:JANコード    (標準:13桁)\n4:JANコード    (短縮:8桁)\n6:GTINコード  (14桁)",null,"属性＋桁数","コード(新)",null,"○","○","○","属性＋コード\n2:利用停止","23",{"$f":"IF($Z46=\"\",\"\",VLOOKUP($Z46,$AF$6:$AM$45,3,))","v":"商品コード識別区分"},"X",1,0]
[null,null,"41",null,"品番",null,"X",16,null,"○","統一商品ｺｰﾄﾞ､ITFｺｰﾄﾞ､JANｺｰﾄﾞ､GTINｺｰﾄﾞ",null,null,"(左詰め)",null,null,null,null,"属性＋桁数",null,null,"○","○","○","ITF(16)\n利用停止","24",{"$f":"IF($Z47=\"\",\"\",VLOOKUP($Z47,$AF$6:$AM$45,3,))","v":"品番"},"X",16,0]
[null,null,"42",null,"商品名",null,"X/N",40,null,null,"商品名",null,"(英数カナは25文字、漢字は20文字)",null,null,null,null,null,null,null,null,"○","属性初期値","◎",null,null,"","","",""]
[null,null,"43",null,"バラ総数符号",null,"X",1,null,"○","数量の符号",null,null,null,null,null,"△/＋:正数","－:負数","属性＋桁数","ｺｰﾄﾞ",null,"○","○","○","コード","25","バラ総数符号","X",1,0]
[null,null,"44",null,"バラ総数",null,9,9,null,"○","届け先への販売数量計",null,null,null,null,null,null,null,"属性＋桁数","属性",null,"○","○",null,null,"26","バラ総数","9",9,0]
[null,null,"45",null,"ケース(ボール)当り入数",null,9,4,null,null,"ケース(ボール)当りのバラ個数　",null,"(総バラ換算の場合はゼロ)",null,null,null,null,null,"属性＋桁数","属性",null,"○","属性初期値","◎",null,null,"","","",""]
[null,null,"46",null,"ケース(ボール)数",null,9,7,null,null,"ケース(ボール)数の値　　　　　 　",null,"(総バラ換算の場合はゼロ)",null,null,null,null,null,"属性＋桁数","属性",null,"○","属性初期値","◎",null,null,"","","",""]
[null,null,"（次頁に続く）"]
[]
[]
[]
[null,null,"　"]
[]
[null,null,"（前頁の続き）"]
[null,"変更","項番","　項目",null,null,"属性","整数桁","小数桁","必須","　項目説明",null,null,null,null,null,"　コード",null,"アップロード","V２ → Ｖ１･Ｖ２","Ｖ２→ Ｖ１","Ｖ２ ← Ｖ２","Ｖ２ ← Ｖ１","　　　　　　　Ｖ１フォーマット"]
[null,null,null,null,null,null,null,null,null,null,null,null,null,null,null,null,null,null,"チェック","センタチェック","センタチェック","コンバート","コンバート","比較・  変更点",null,"項番","　　項目","属性","整数","小数"]
[null,null,"47",null,"販売単価区分",null,"X",1,null,null,"販売単価の区分",null,null,null,null,null,"1:ケース単価\n2:ボール単価","△/3:バラ単価",null,"ｺｰﾄﾞ",null,"○","属性初期値","◎",null,null,{"$f":"IF($Z62=\"\",\"\",VLOOKUP($Z62,$AF$6:$AM$45,3,))","v":""},{"$f":"IF($Z62=\"\",\"\",VLOOKUP($Z62,$AF$6:$AM$45,5,))","v":""},{"$f":"IF($Z62=\"\",\"\",VLOOKUP($Z62,$AF$6:$AM$45,6,))","v":""},{"$f":"IF($Z62=\"\",\"\",VLOOKUP($Z62,$AF$6:$AM$45,7,))","v":""}]
[null,null,"48",null,"単 価",null,9,7,2,"○","届け先への販売単価",null,"(ケース／ボール／バラ)",null,null,null,null,null,"属性＋桁数","属性",null,"○","○","○","桁数","27","単価","9",6,2]
[null,null,"49",null,"金額符号",null,"X",1,null,"○","金額の符号",null,null,null,null,null,"△/＋:正数","－:負数","属性＋桁数","ｺｰﾄﾞ",null,"○","○","○","コード","28","金額符号","X",1,0]
[null,null,"50",null,"金額",null,9,10,null,"○","届け先への販売金額",null,null,null,null,null,null,null,"属性＋桁数","属性",null,"○","○",null,null,"29","金額","9",10,0]
[null,null,"51",null,"特売区分",null,"X",1,null,null,"定番納品／特売納品を指定",null,null,null,null,null,"△/0:分類不能\n1:定番納品","2:特売納品",null,"ｺｰﾄﾞ",null,"○","属性初期値","◎",null,null,"","","",""]
[null,null,"52",null,"納品日",null,9,8,null,null,"実際の納品日",null,"(西暦 YYYYMMDD)",null,null,null,null,null,"属性＋桁数","日付",null,"○","属性初期値","◎",null,null,"","","",""]
[null,null,"53",null,"倉出・合計区分",null,"X",1,null,null,"実績が倉出しを含むか、直送のみかを指定",null,null,null,null,null,"△:無指定\n0:倉出＋直送","1:倉出のみ",null,"ｺｰﾄﾞ",null,"○","属性初期値","◎",null,null,"","","",""]
[null,null,"54",null,"日本語区分（商品名）",null,"X",1,null,null,"該当項目の日本語区分",null,null,null,null,null,"△/0:英数カナ\n1:　　漢字(S-JIS/JIS/JEF/IBM)",null,null,"ｺｰﾄﾞ",null,"○","属性初期値","◎",null,null,"","","",""]
[null,null,"55",null,"菓子業界商品分類コード",null,"X",6,null,null,"菓子業界の新商品分類コード",null,"(JICFSの機能分類コードとして登録)",null,null,null,null,null,null,null,null,"○","属性初期値","◎",null,null,"","","",""]
[null,1.8,"56","レコード件数",null,null,9,6,null,"○","レコードの総件数\n・データ送信側では、自身のフォーマットのレコード件数を設定する。\n・データ受信側では、当項目と実際のレコード件数の整合性チェックには利用しない。※下記【トレーラレコード連携時の留意事項】を参照のこと\n",null,null,null,null,null,null,null,"属性＋桁数","属性","センタチェック","　  センター集計値"," センター集計値",null,null,"32",{"$f":"IF($Z71=\"\",\"\",VLOOKUP($Z71,$AF$6:$AM$45,2,))","v":"レコード件数"},"9",6,0]
[null,1.6,"57","明細件数",null,null,9,6,null,null,"商品明細数（有効明細数）",null,null,null,null,null,null,null,"属性＋桁数","属性","と同じ","　  センター集計値"," センター集計値",null,null,"33","明細件数","9",6,0]
[null,null,"58","合計金額符号",null,null,"X",1,null,null,"合計金額の符号",null,null,null,null,null,"△/＋:整数","－:負数","属性","ｺｰﾄﾞ",null,"　  センター設定　 "," センター設定　 ","○","コード","34","合計金額符号","X",1,0]
[null,null,"59","合計金額",null,null,9,10,null,null,"卸店入金額の全明細行の金額合計",null,null,null,null,null,null,null,"属性＋桁数","属性",null,"　  センター集計値"," センター集計値",null,null,"35","合計金額","9",10,0]
[null,null,"60","連携エリア",null,null,"X",20,null,null,"新フォーマット間：相対利用可能エリア",null,null,null,null,null,null,null,null,null,null,"○","属性初期値","◎",null,null,"","","",""]
[null,1.1000000000000001,"61","一次店カナ名",null,null,"Ｘ","30",null,null,"一次店カナ名",null,"(一次店名 に漢字を設定する場合、必須)",null,null,null,null,null,null,null,null,"○","属性初期値","◎",null,null,"","","",""]
[null,1.1000000000000001,"62","二次店カナ名",null,null,"Ｘ","30",null,null,"二次店カナ名",null,"(二次店名 に漢字を設定する場合、必須)",null,null,null,null,null,null,null,null,"○","属性初期値","◎",null,null,"","","",""]
[null,1.1000000000000001,"63","届け先カナ名",null,null,"Ｘ","30",null,null,"届け先カナ名",null,"(届け先名  に漢字を設定する場合、必須)",null,null,null,null,null,null,null,null,"○","属性初期値","◎",null,null,"","","",""]
[null,1.1000000000000001,"64","商品名カナ",null,null,"X","25",null,null,"商品名カナ",null,"(商品名     に漢字を設定する場合、必須)",null,null,null,null,null,null,null,null,"○","属性初期値","◎",null,null,"","","",""]
[null,null,"65","改行コード",null,null,"X","2",null,null,"S-JISの改行コードを設定",null,null,null,null,null,null,null,null,null,null,null,null,null,null,null,"","","",""]
[]
[]
[null,null,null,null,null,null,null,null,null,null," ※ファイルの形式は、カンマ区切りの可変長形式となります。各項目の値にダブルクォート「\"」の囲みは不要です。"]
[null,null,null,null,null,null,null,null,null,null," ※画面から受信（ダウンロード）したファイルの最終行にはエンドレコードが出力されます。"]
[null,null,null,null,null,null,null,null,null,null,"　  エンドレコードのレイアウトは「エンドレコード」を参照してください。"]
[null,null,null,null,null,null,null,null,null,null," ※画面から送信（アップロード）するファイルにエンドレコードは不要です。"]

{"sheet":"集配信状況照会","index":16,"n_rows":22,"n_cols":38,"rows_kept":22,"cut":false,"hidden":false,"merged":[[4,9,5,9],[4,10,5,10],[4,1,5,1],[4,2,5,2],[4,3,5,4],[4,6,5,6],[4,7,5,7],[4,8,5,8]]}
["　３． 共通・Web-EDIフォーマット",null,null,null,null,null,null,null,null,null,null,null,null,null,null,null,null,null,null,null,null,null,null,null,null,null,null,null,null,null,null,null,null,null,null,null,null,{"$f":"シート別総ページ数","v":{"$error":"#NAME?"}}]
["　　　３.１  共通・ＣＳＶフォーマット"]
[null,null,"（１） 集配信状況照会ダウンロード"]
[null,null,"　"]
[null,"変更","項番","　項目",null,null,"属性","整数桁","小数桁","必須","　項目説明"]
[]
[null,null,"1","ＮＯ",null,null,9,3,null,null,"集配信状況照会画面のＮＯ"]
[null,null,"2","送信元ＮＯ",null,null,"N",4,null,null,"集配信状況照会画面の送信元ＮＯ"]
[null,null,"3","データ種",null,null,"N",4,null,null,"集配信状況照会画面で指定した検索条件のデータ種名称"]
[null,null,"4","状態",null,null,"N",4,null,null,"集配信状況照会画面の状態"]
[null,null,"5","格納日付",null,null,"X",10,null,null,"集配信状況照会画面の格納日時の日付部分（YYYY/MM/DD形式）"]
[null,null,"6","格納時間",null,null,"X",5,null,null,"集配信状況照会画面の格納日時の時間部分（HH:MM形式）"]
[null,null,"7","通信ＩＤ",null,null,"X",10,null,null,"集配信状況照会画面の通信ＩＤ（YYYY/MM/DD形式）"]
[null,null,"8","件数",null,null,9,7,null,null,"集配信状況照会画面の件数（カンマ編集なし）"]
[null,null,"9","送受信日付",null,null,"X",10,null,null,"集配信状況照会画面の送受信日付（YYYY/MM/DD形式）"]
[null,null,"10","送受信時刻（Ｓ）",null,null,"X",5,null,null,"集配信状況照会画面の送受信時刻（開始、HH:MM形式）"]
[null,null,"11","送受信時刻（Ｅ）",null,null,"X",5,null,null,"集配信状況照会画面の送受信時刻（終了、HH:MM形式）"]
[null,null,"12","取引先コード",null,null,"X",8,null,null,"集配信状況照会画面の取引先"]
[null,null,"13","取引先名",null,null,"N",30,null,null,"集配信状況照会画面の取引先名"]
[null,null,"14","種別",null,null,"X",5,null,null,"集配信状況照会画面の種別名"]
[null,null,"15","確認欄",null,null,"X",0,null,null,"空白"]
[null,null,"16","改行コード",null,null,"X",2,null,null,"S-JISの改行コードを設定"]

{"sheet":"エンドレコード","index":17,"n_rows":10,"n_cols":38,"rows_kept":10,"cut":false,"hidden":false,"merged":[[4,9,5,9],[4,10,5,10],[4,1,5,1],[4,2,5,2],[4,3,5,4],[4,6,5,6],[4,7,5,7],[4,8,5,8]]}
[null,null,null,null,null,null,null,null,null,null,null,null,null,null,null,null,null,null,null,null,null,null,null,null,null,null,null,null,null,null,null,null,null,null,null,null,null,{"$f":"シート別総ページ数","v":{"$error":"#NAME?"}}]
[]
[null,null,"（２） エンドレコード"]
[null,null,"　"]
[null,"変更","項番","　項目",null,null,"属性","整数桁","小数桁","必須","　項目説明"]
[]
[null,null,"1","エンド情報",null,null,"X",3,null,null,"\"END\"固定"]
[null,null,"2","処理日時",null,null,8,14,null,null,"ダウンロード/再ダウンロードした日時"]
[null,null,"3","レコード件数",null,null,"9",4,null,null,"ダウンロード/再ダウンロードした有効レコード件数"]
[null,null,"4","改行コード",null,null,"X",2,null,null,"S-JISの改行コードを設定"]